| Name | Status | Type | Time(s) | LogFile |
| test_basic_RR[sanity] | Skipped | Skipping Test. Env variable MX_GW_TEST is not set. Skipping the test | 1.339 | |
| test_create_vm_after_RR_set[sanity] | Skipped | Skipping Test. Env variable MX_GW_TEST is not set. Skipping the test | 1.225 | |
| test_contrail_status[cb_sanity,ci_sanity,dev_sanity_dpdk,sanity] | Success | | 1.762 | |
| test_db_nodemgr_status[dev_sanity_dpdk,sanity] | Success | | 1.808 | |
| test_verify_generator_collector_connections[dev_sanity_dpdk,sanity] | Success | | 3.330 | |
| test_verify_generator_connections_to_collector_node[dev_sanity_dpdk,sanity] | Success | | 2.028 | |
| test_verify_process_status_agent[cb_sanity,dev_sanity_dpdk,sanity] | Success | | 1.268 | |
| test_verify_process_status_analytics_node[cb_sanity,dev_sanity_dpdk,sanity] | Success | | 1.630 | |
| test_verify_process_status_control_node[cb_sanity,dev_sanity_dpdk,sanity] | Success | | 1.363 | |
| test_verify_object_logs[ci_sanity,dev_sanity_dpdk,sanity,suite1] | Success | | 49.103 | |
| test_db_manage[cb_sanity,ci_sanity,dev_sanity_dpdk,sanity] | Success | | 5.579 | |
| test_analytics_docs[cb_sanity,ci_sanity,dev_sanity_dpdk,sanity] | Success | | 1.307 | |
| test_config_docs[cb_sanity,ci_sanity,dev_sanity_dpdk,sanity] | Success | | 1.335 | |
| test_ecmp_hash_src_ip[sanity] | Skipped | Skipped as test requires at least 3 nodes, but only 2 found | 1.248 | |
| test_ecmp_svc_v2_in_network_nat_with_3_instance[cb_sanity,sanity] | Skipped | Skipped as test requires at least 3 nodes, but only 2 found | 1.256 | |
| test_ecmp_svc_in_network_with_static_route_no_policy[sanity] | Skipped | image /contrail-test/images/tinycore-in-network.qcow2 is not found | 2.051 | |
| test_ecmp_svc_v2_transparent_with_3_instance[cb_sanity,sanity] | Skipped | Skipped as test requires at least 3 nodes, but only 2 found | 1.378 | |
| test_ecmp_svc_in_network_with_static_route_no_policy[sanity] | Skipped | image /contrail-test/images/tinycore-in-network.qcow2 is not found | 1.853 | |
| test_ecmp_svc_v2_transparent_with_3_instance[cb_sanity,sanity] | Skipped | Skipped as test requires at least 3 nodes, but only 2 found | 1.231 | |
| test_ecmp_svc_in_network_with_3_instance[cb_sanity,sanity] | Skipped | Skipped as test requires at least 3 nodes, but only 2 found | 1.222 | |
| test_ecmp_with_svm_deletion[sanity] | Skipped | Skipped as test requires at least 3 nodes, but only 2 found | 1.236 | |
| test_svc_fate_sharing_basic[sanity] | Skipped | image /contrail-test/images/tinycore-in-network.qcow2 is not found | 1.966 | |
| test_three_stage_v2_SC[sanity] | Skipped | Skipped as test requires at least 3 nodes, but only 2 found | 1.272 | |
| test_svc_fate_sharing_basic[sanity] | Skipped | image /contrail-test/images/tinycore-in-network.qcow2 is not found | 3.102 | |
| test_floating_ip[cb_sanity,ci_contrail_go_kolla_ocata_sanity,ci_sanity,quick_sanity,sanity,suite1,vrouter_gw] | Success | | 207.439 | |
| test_mx_gateway[mx_test,sanity] | Skipped | Skipping Test. Env variable MX_GW_TEST is not set | 2.524 | |
| test_public_access_thru_svc_w_fip[cb_sanity,sanity] | Skipped | Skipped as test requires at least 3 nodes, but only 2 found | 2.549 | |
| test_transit_vn_sym_1_innet[sanity] | Skipped | Skipped as test requires at least 3 nodes, but only 2 found | 2.540 | |
| test_public_access_thru_svc_w_fip[cb_sanity,sanity] | Skipped | Skipped as v6 not supported for this test | 2.566 | |
| test_svc_creation_with_heat[dev_sanity_dpdk,sanity,suite1] | Skipped | Skipped as test requires at least 3 nodes, but only 2 found | 2.548 | |
| test_svc_creation_with_heat[sanity] | Skipped | Skipped as test requires at least 3 nodes, but only 2 found | 2.608 | |
| test_network_tags_crud[ci_sanity,sanity] | Success | | 8.410 | |
| test_router_crud[ci_sanity,dev_sanity_dpdk,sanity] | Success | | 7.779 | |
| test_ports_bindings[ci_sanity,dev_sanity_dpdk,sanity] | Success | | 4.628 | |
| test_ports_specific_subnet_ip[ci_sanity,dev_sanity_dpdk,sanity] | Success | | 41.368 | |
| test_basic_router_behavior[ci_sanity,dev_sanity_dpdk,sanity] | Success | | 58.592 | |
| test_basic_snat_behavior_without_external_connectivity[ci_sanity,dev_sanity_dpdk,sanity,suite1] | Success | | 45.102 | |
| test_basic_policy_allow_deny[cb_sanity,ci_contrail_go_kolla_ocata_sanity,ci_sanity,quick_sanity,sanity,suite1] | Success | | 90.529 | |
| test_policy[quick_sanity,sanity] | Success | | 233.332 | |
| test_policy_to_deny[quick_sanity,sanity] | Success | | 90.047 | |
| test_policy_modify_vn_policy[sanity] | Success | | 113.022 | |
| test_remove_policy_with_ref[ci_sanity,sanity] | Success | | 9.329 | |
| test_policy_inheritance_src_vn_dst_pol[cb_sanity,sanity,vrouter_gw] | Success | | 194.518 | |
| test_policy_inheritance_src_pol_dst_any[sanity] | Success | | 207.636 | |
| test_basic_policy_allow_deny[cb_sanity,ci_contrail_go_kolla_ocata_sanity,ci_sanity,quick_sanity,sanity,suite1] | Success | | 88.828 | |
| test_repeated_policy_modify[sanity] | Success | | 174.998 | |
| test_multi_vn_repeated_policy_update_with_ping[sanity] | Success | | 235.562 | |
| test_multi_vn_repeated_policy_update_with_ping[sanity] | Success | | 237.015 | |
| test_qos_remark_dscp_on_vmi[cb_sanity,sanity] | Success | | 60.840 | |
| test_rp_interface[ci_sanity,sanity] | Success | | 50.111 | |
| test_rp_interface_ext_community[sanity] | Success | | 51.273 | |
| test_rp_interface_static[sanity] | Success | | 50.475 | |
| test_rp_secondary_routes[sanity] | Skipped | Needs MX_GW_TEST to be set | 0.002 | |
| test_rt_CEM_22032[cb_sanity,sanity] | Success | | 85.007 | |
| test_user_def_rt_entry[cb_sanity,sanity] | Success | | 82.484 | |
| test_sec_group_basic[sanity,suite1] | Success | | 140.349 | |
| test_sec_group_basic[sanity,suite1] | Success | | 205.430 | |
| test_sec_group_basic[cb_sanity,ci_contrail_go_kolla_ocata_sanity,sanity,suite1] | Success | | 206.830 | |
| test_svc_in_net_nat_with_static_routes[sanity] | Skipped | image /contrail-test/images/tinycore-in-network-nat.qcow2 is not found | 41.357 | |
| test_svc_v2_transparent_datapath[sanity] | Skipped | image /contrail-test/images/tinycore-net-transparent-fw.qcow2 is not found | 10.058 | |
| test_svc_CEM_22032[ci_sanity_WIP,quick_sanity,sanity,suite1] | Skipped | image /contrail-test/images/tinycore-in-network-nat.qcow2 is not found | 9.898 | |
| test_svc_in_network_datapath[ci_sanity_WIP,quick_sanity,sanity,suite1] | Skipped | image /contrail-test/images/tinycore-in-network-nat.qcow2 is not found | 7.941 | |
| test_svc_hc_basic[sanity] | Skipped | image /contrail-test/images/tinycore-in-network-nat.qcow2 is not found | 9.945 | |
| test_svc_trans_segment_right_hc_fail_svm[sanity] | Skipped | image /contrail-test/images/tinycore-net-transparent-fw.qcow2 is not found | 15.225 | |
| test_svc_v2_mirroring[ci_sanity_WIP,quick_sanity,sanity] | Success | | 189.428 | |
| test_vdns_ping_same_vn[ci_sanity,sanity,suite1] | Success | | 170.668 | |
| test_sctp_traffic_between_vm[sanity] | Success | | 167.244 | |
| test_generic_link_local_service[cb_sanity,ci_contrail_go_kolla_ocata_sanity,ci_sanity,dev_sanity_dpdk,sanity,suite1] | Success | | 42.817 | |
| test_metadata_service[cb_sanity,ci_sanity,sanity,suite1] | Success | | 40.935 | |
| test_ping_within_vn_two_vms_two_different_subnets[ci_contrail_go_kolla_ocata_sanity,ci_sanity,sanity,suite1] | Success | | 73.646 | |
| test_ecmp_with_static_routes[cb_sanity,dev_reg,sanity] | Success | | 277.463 | |
| test_bond_lacp_config[dev_reg,sanity] | Skipped | Skipped as test is not supported if dpdk_cluster=False | 2.538 | |
| test_dpdk_bond_status[dev_reg,sanity] | Skipped | Skipped as test is not supported if dpdk_cluster=False | 2.548 | |
| test_fbit_disable_mbuf_dpdk[dev_reg,sanity] | Skipped | Skipped as test is not supported if dpdk_cluster=False | 2.517 | |
| test_dpdk_gro_gso[dev_reg,sanity] | Skipped | Skipped as test is not supported if dpdk_cluster=False | 2.606 | |
| test_mtu_config[dev_reg,sanity] | Skipped | Skipped as test is not supported if dpdk_cluster=False | 2.545 | |
| test_vifdump_on_interface[dev_reg,sanity] | Skipped | Skipped as test is not supported if dpdk_cluster=False | 2.521 | |
| test_fat_flow_aggr_dest_icmp_intra_vn_inter_node[dev_reg,sanity] | Success | | 290.270 | |
| test_rt_table_scenario_1[dev_reg,sanity] | Success | | 55.683 | |
| test_vlan_interface_2[cb_sanity,dev_reg,dev_sanity_dpdk,sanity] | Success | | 162.027 | |
| test_mtu_probe_intra_node[dev_reg,sanity] | Success | | 171.361 | |
| test_vif_statistics[dev_reg,sanity] | Success | | 110.276 | |
| Name | Status | Type | Time(s) | LogFile |
| test_run_contrail_flows_cli_cmds[sanity] | Success | | 14.048 | |
| test_run_contrail_logs_cli_cmd_with_multiple_different_optional_args[sanity] | Success | | 19.883 | |
| test_run_contrail_stats_cli_cmds[sanity] | Success | | 27.350 | |
| test_verify_session_sampling_teardown[sanity] | Success | | 225.453 | |
| test_basic_as4_ibgp_sanity[sanity] | Skipped | Skipping Test. At least 1 external router required to run the test | 2.503 | |
| test_basic_bgpaas_local_as[dev_sanity_dpdk,sanity] | Success | | 172.141 | |
| test_bgp_control_node_zone[sanity] | Success | | 227.957 | |
| test_bgp_control_node_zones_from_single_vnf[sanity] | Success | | 175.479 | |
| test_basic_dm[sanity] | Skipped | dm_mx env needs to be set in testbed.py to run this script | 2.526 | |
| test_apply_policy_fip_on_same_vn_gw_mx[sanity,serial] | Skipped | Skipping Test. Env variable MX_TEST is not set. Skipping the test | 2.530 | |
| test_with_vxlan_encap_agent_restart[sanity,serial] | Success | | 269.833 | |
| test_change_of_rt_in_vn[mx_test,sanity,serial] | Skipped | Skipping Test. Env variable MX_GW_TEST is not set | 2.500 | |
| test_gw_less_fwd_single_vn_ip_fab[cb_sanity,sanity] | Skipped | Skipping Test. Fabric gateway is required to run the test | 2.492 | |
| test_check_per_peer_on_control[sanity] | Success | | 73.005 | |
| test_create_md5_on_control[sanity] | Success | | 73.155 | |
| test_perms2_global_share[ci_sanity,sanity] | Success | | 57.081 | |
| test_perms2_owner[ci_sanity,sanity,suite1] | Success | | 16.744 | |
| test_rbac_acl_different_roles[ci_sanity,sanity,suite1] | Success | | 18.168 | |
| test_rbac_create_delete_vm[sanity,suite1] | Success | | 75.025 | |
| test_contrail_status[cb_sanity,ci_sanity,dev_sanity_dpdk,sanity] | Success | | 3.269 | |
| test_control_node_switchover[cb_sanity,sanity] | Success | | 192.806 | |
| test_process_restart_in_policy_between_vns[cb_sanity,sanity] | Success | | 359.236 | |
| test_underlay_broadcast_traffic_handling[sanity] | Success | | 26.923 | |
| test_flow_action_drop_stats[dev_reg,sanity] | Failure | Details
Traceback (most recent call last):
testtools.testresult.real._StringException: Traceback (most recent call last):
File "/contrail-test/tcutils/wrappers.py", line 176, in wrapper
raise TestFailed("\n ".join(errmsg))
tcutils.cores.TestFailed: Test failed: IndexError
Python 3.9.25: /usr/bin/python3
Mon Oct 12 04:35:09 2026
A problem occurred in a Python script. Here is the sequence of
function calls leading up to the error, in the order they occurred.
/contrail-test/tcutils/wrappers.py in wrapper(self=<serial_scripts.vrouter.test_drop_stats.TestDrop...ion_drop_stats[dev_reg,sanity] id=0x7f152b747610>, *args=(), **kwargs={})
78 log.info('Initial checks done. Running the testcase now')
79 log.info('')
80 result = function(self, *args, **kwargs)
81 if self.inputs.upgrade:
82 pid = os.getpid()
result = None
function = <function TestDropStats.test_flow_action_drop_stats>
self = <serial_scripts.vrouter.test_drop_stats.TestDrop...ion_drop_stats[dev_reg,sanity] id=0x7f152b747610>
args = ()
kwargs = {}
/contrail-test/serial_scripts/vrouter/test_drop_stats.py in test_flow_action_drop_stats(self=<serial_scripts.vrouter.test_drop_stats.TestDrop...ion_drop_stats[dev_reg,sanity] id=0x7f152b747610>)
36 raise self.skipTest("Skipping test case,this test needs atleast 2 compute nodes")
37
38 assert self.verify_flow_action_drop_stats()
39 return True
40 # end test_drop_stats
self = <serial_scripts.vrouter.test_drop_stats.TestDrop...ion_drop_stats[dev_reg,sanity] id=0x7f152b747610>
self.verify_flow_action_drop_stats = <bound method BaseDropStats.verify_flow_action_d...on_drop_stats[dev_reg,sanity] id=0x7f152b747610>>
/contrail-test/common/vrouter/base_drop_stats.py in verify_flow_action_drop_stats(self=<serial_scripts.vrouter.test_drop_stats.TestDrop...ion_drop_stats[dev_reg,sanity] id=0x7f152b747610>, drop_type='ds_flow_action_drop')
51 fq_name = intf_details[0]['config_name']
52
53 vif_dict_before = self.get_drop_stats_dict(compute0, fq_name)[1]
54 self.print_drop_stats_dict(vif_dict_before)
55
vif_dict_before undefined
self = <serial_scripts.vrouter.test_drop_stats.TestDrop...ion_drop_stats[dev_reg,sanity] id=0x7f152b747610>
self.get_drop_stats_dict = <bound method retry.<locals>.deco_retry.<locals>...on_drop_stats[dev_reg,sanity] id=0x7f152b747610>>
compute0 = '10.0.0.188'
fq_name = 'default-domain:ctest-TestDropStats-92709071:d2fec49a-4b72-4267-befd-c597b37ec97a'
/contrail-test/tcutils/util.py in f_retry(*args=(<serial_scripts.vrouter.test_drop_stats.TestDrop...ion_drop_stats[dev_reg,sanity] id=0x7f152b747610>, '10.0.0.188', 'default-domain:ctest-TestDropStats-92709071:d2fec49a-4b72-4267-befd-c597b37ec97a'), **kwargs={})
82 mtries, mdelay = tries, delay # make mutable
83
84 result = f(*args, **kwargs) # first attempt
85 rv = result
86 final = False
result undefined
f = <function BaseDropStats.get_drop_stats_dict>
args = (<serial_scripts.vrouter.test_drop_stats.TestDrop...ion_drop_stats[dev_reg,sanity] id=0x7f152b747610>, '10.0.0.188', 'default-domain:ctest-TestDropStats-92709071:d2fec49a-4b72-4267-befd-c597b37ec97a')
kwargs = {}
/contrail-test/common/vrouter/base_drop_stats.py in get_drop_stats_dict(self=<serial_scripts.vrouter.test_drop_stats.TestDrop...ion_drop_stats[dev_reg,sanity] id=0x7f152b747610>, compute='10.0.0.188', fq_name='default-domain:ctest-TestDropStats-92709071:d2fec49a-4b72-4267-befd-c597b37ec97a', module='vif')
29 drop_stats_list = self.agent_inspect_h[compute].get_agent_vrouter_drop_stats()
30 else:
31 drop_stats_list = self.agent_inspect_h[compute].get_agent_vm_interface_drop_stats(fq_name)
32
33 if drop_stats_list is not None:
drop_stats_list undefined
self = <serial_scripts.vrouter.test_drop_stats.TestDrop...ion_drop_stats[dev_reg,sanity] id=0x7f152b747610>
self.agent_inspect_h = {}
compute = '10.0.0.188'
].get_agent_vm_interface_drop_stats undefined
fq_name = 'default-domain:ctest-TestDropStats-92709071:d2fec49a-4b72-4267-befd-c597b37ec97a'
/contrail-test/tcutils/agent/vna_introspect_utils.py in get_agent_vm_interface_drop_stats(self=<tcutils.agent.vna_introspect_utils.AgentInspect object>, fq_name='default-domain:ctest-TestDropStats-92709071:d2fec49a-4b72-4267-befd-c597b37ec97a')
1039 except IndexError:
1040 return None
1041 return l[0]
1042 # end get_agent_vm_interface_drop_stats
1043
l = []
IndexError: list index out of range
__cause__ = None
__class__ = <class 'IndexError'>
__context__ = None
__delattr__ = <method-wrapper '__delattr__' of IndexError object>
__dict__ = {}
__dir__ = <built-in method __dir__ of IndexError object>
__doc__ = 'Sequence index out of range.'
__eq__ = <method-wrapper '__eq__' of IndexError object>
__format__ = <built-in method __format__ of IndexError object>
__ge__ = <method-wrapper '__ge__' of IndexError object>
__getattribute__ = <method-wrapper '__getattribute__' of IndexError object>
__gt__ = <method-wrapper '__gt__' of IndexError object>
__hash__ = <method-wrapper '__hash__' of IndexError object>
__init__ = <method-wrapper '__init__' of IndexError object>
__init_subclass__ = <built-in method __init_subclass__ of type object>
__le__ = <method-wrapper '__le__' of IndexError object>
__lt__ = <method-wrapper '__lt__' of IndexError object>
__ne__ = <method-wrapper '__ne__' of IndexError object>
__new__ = <built-in method __new__ of type object>
__reduce__ = <built-in method __reduce__ of IndexError object>
__reduce_ex__ = <built-in method __reduce_ex__ of IndexError object>
__repr__ = <method-wrapper '__repr__' of IndexError object>
__setattr__ = <method-wrapper '__setattr__' of IndexError object>
__setstate__ = <built-in method __setstate__ of IndexError object>
__sizeof__ = <built-in method __sizeof__ of IndexError object>
__str__ = <method-wrapper '__str__' of IndexError object>
__subclasshook__ = <built-in method __subclasshook__ of type object>
__suppress_context__ = False
__traceback__ = <traceback object>
args = ('list index out of range',)
with_traceback = <built-in method with_traceback of IndexError object>
The above is a description of an error in a Python program. Here is
the original traceback:
Traceback (most recent call last):
File "/contrail-test/tcutils/wrappers.py", line 80, in wrapper
result = function(self, *args, **kwargs)
File "/contrail-test/serial_scripts/vrouter/test_drop_stats.py", line 38, in test_flow_action_drop_stats
assert self.verify_flow_action_drop_stats()
File "/contrail-test/common/vrouter/base_drop_stats.py", line 53, in verify_flow_action_drop_stats
vif_dict_before = self.get_drop_stats_dict(compute0, fq_name)[1]
File "/contrail-test/tcutils/util.py", line 84, in f_retry
result = f(*args, **kwargs) # first attempt
File "/contrail-test/common/vrouter/base_drop_stats.py", line 31, in get_drop_stats_dict
drop_stats_list = self.agent_inspect_h[compute].get_agent_vm_interface_drop_stats(fq_name)
File "/contrail-test/tcutils/agent/vna_introspect_utils.py", line 1041, in get_agent_vm_interface_drop_stats
return l[0]
IndexError: list index out of range
| 86.317 |
Log File
|
| test_fat_flow_aggr_dest_udp_inter_vn_inter_node[dev_reg,sanity] | Success | | 349.892 | |
| test_fat_flow_intra_vn_inter_node[cb_sanity,sanity] | Success | | 239.275 | |
| test_precedence_xmpp_auth[sanity] | Skipped | Xmpp auth should be set before running tests | 2.505 | |
| test_undo_xmpp_auth[sanity] | Skipped | Xmpp auth should be set before running tests | 2.496 | |