2026-10-05 04:30:08,424 - INFO - Domain Default found not creating
2026-10-05 04:30:08,654 - INFO - Project ctest-TestBasicVMVN-06923401 not found, creating it
2026-10-05 04:30:09,365 - INFO - Created Project:ctest-TestBasicVMVN-06923401, ID : 8306610e-8e60-45ac-9274-7e7784afdd15
2026-10-05 04:30:11,580 - INFO - ================================================================================
2026-10-05 04:30:11,580 - INFO - STARTING TEST : test_generic_link_local_service
2026-10-05 04:30:11,580 - INFO - TEST DESCRIPTION :
Description: Test to validate generic linklocal service - running nova list from vm.
1.Create generic link local service to be able to wget to jenkins
2.Create a vm
3.Try wget to jenkins - passes if successful else fails
Maintainer: sandipd@juniper.net
2026-10-05 04:30:12,917 - DEBUG - Nothing to compare xmpp stats {'10.0.0.50': {'10.20.0.14': '0', '10.20.0.25': '0'}, '10.0.0.191': {'10.20.0.254': '0', '10.20.0.25': '0'}} with
2026-10-05 04:30:12,917 - INFO - Initial checks done. Running the testcase now
2026-10-05 04:30:12,917 - INFO -
2026-10-05 04:30:13,794 - DEBUG - Response for create_network : {'network': {'id': '7ad20f25-646f-4e39-9655-0af8e542b809', 'name': 'ctest-vn2_metadata-84526223', 'tenant_id': '8306610e8e6045ac92747e7784afdd15', 'project_id': '8306610e8e6045ac92747e7784afdd15', 'admin_state_up': True, 'shared': False, 'status': 'ACTIVE', 'router:external': False, 'mtu': 0, 'tags': [], 'subnets': [], 'fq_name': ['default-domain', 'ctest-TestBasicVMVN-06923401', 'ctest-vn2_metadata-84526223'], 'port_security_enabled': True, 'description': ''}}
2026-10-05 04:30:14,076 - DEBUG - Response for create_subnet : {'subnet': {'id': 'ab157c2e-bab1-4110-903a-f44fc42a4f83', 'name': '', 'tenant_id': '8306610e8e6045ac92747e7784afdd15', 'network_id': '7ad20f25-646f-4e39-9655-0af8e542b809', 'ip_version': 4, 'cidr': '11.1.1.0/24', 'allocation_pools': [{'start': '11.1.1.2', 'end': '11.1.1.254'}], 'gateway_ip': '11.1.1.1', 'enable_dhcp': True, 'ipv6_ra_mode': None, 'ipv6_address_mode': None, 'dns_nameservers': [], 'host_routes': [], 'dns_server_address': '11.1.1.2', 'tags': [], 'project_id': '8306610e8e6045ac92747e7784afdd15'}}
2026-10-05 04:30:14,100 - INFO - Created VN ctest-vn2_metadata-84526223
2026-10-05 04:30:14,116 - DEBUG - VN ctest-vn2_metadata-84526223 UUID is 7ad20f25-646f-4e39-9655-0af8e542b809
2026-10-05 04:30:14,424 - DEBUG - Services list from nova: [, , , ]
2026-10-05 04:30:15,093 - INFO - VM ([]) created on node: (an-jenkins-deploy-platform-ansible-os-6343-1), Zone: (nova:an-jenkins-deploy-platform-ansible-os-6343-1)
2026-10-05 04:30:15,170 - DEBUG - Link local service introspect added
2026-10-05 04:30:15,229 - DEBUG - VM is still in BUILD state, Expected: ACTIVE
2026-10-05 04:30:20,334 - DEBUG - VM is still in BUILD state, Expected: ACTIVE
2026-10-05 04:30:25,458 - DEBUG - VM is still in BUILD state, Expected: ACTIVE
2026-10-05 04:30:30,561 - DEBUG - VM is still in BUILD state, Expected: ACTIVE
2026-10-05 04:30:35,664 - DEBUG - VM is still in BUILD state, Expected: ACTIVE
2026-10-05 04:30:40,769 - DEBUG - VM is in ACTIVE state now
2026-10-05 04:30:41,017 - INFO - Waiting for VM ctest-TestBasicVMVN-06923401-76304352 to be up..
2026-10-05 04:30:41,017 - INFO - VM name : ctest-TestBasicVMVN-06923401-76304352
2026-10-05 04:30:41,123 - DEBUG - VM ctest-TestBasicVMVN-06923401-76304352 ID is b4d02e11-3742-4c02-96bc-31081036f5af
2026-10-05 04:30:41,123 - DEBUG - VM ctest-TestBasicVMVN-06923401-76304352 launched on Node an-jenkins-deploy-platform-ansible-os-6343-1
2026-10-05 04:30:41,216 - DEBUG - Requesting: http://10.0.0.190:8082/virtual-machine/b4d02e11-3742-4c02-96bc-31081036f5af
2026-10-05 04:30:41,605 - DEBUG - Requesting: http://10.0.0.190:8082/virtual-machine/b4d02e11-3742-4c02-96bc-31081036f5af
2026-10-05 04:30:41,653 - DEBUG - Requesting: http://10.0.0.190:8082/virtual-machine-interface/35131f9a-fd82-4f49-85d7-a5c1e5a21ef5
2026-10-05 04:30:44,866 - DEBUG - (True, 'PING 169.254.0.3 (169.254.0.3) 56(84) bytes of data.\r\n\r\n--- 169.254.0.3 ping statistics ---\r\n2 packets transmitted, 0 received, 100% packet loss, time 1025ms')
2026-10-05 04:30:44,866 - DEBUG - Ping to Metadata IP 169.254.0.3 of VM ctest-TestBasicVMVN-06923401-76304352 failed!
2026-10-05 04:30:44,887 - DEBUG - Gateway for vn default-domain:ctest-TestBasicVMVN-06923401:ctest-vn2_metadata-84526223 is 11.1.1.1 and allocation pool is NOT set
2026-10-05 04:30:48,956 - DEBUG - (True, 'PING 169.254.0.3 (169.254.0.3) 56(84) bytes of data.\r\n64 bytes from 169.254.0.3: icmp_seq=2 ttl=63 time=5.69 ms\r\n\r\n--- 169.254.0.3 ping statistics ---\r\n2 packets transmitted, 1 received, 50% packet loss, time 1005ms\r\nrtt min/avg/max/mdev = 5.692/5.692/5.692/0.000 ms')
2026-10-05 04:30:48,957 - INFO - Ping to Metadata IP 169.254.0.3 of VM ctest-TestBasicVMVN-06923401-76304352 passed
2026-10-05 04:30:49,034 - DEBUG - verify_vm_launched is skipped since self.vm_launch_flag is set
2026-10-05 04:30:49,034 - DEBUG - Waiting to SSH to VM ctest-TestBasicVMVN-06923401-76304352, IP 11.1.1.3, Port 22
2026-10-05 04:30:49,209 - DEBUG - VM ctest-TestBasicVMVN-06923401-76304352 is ready for SSH connections
2026-10-05 04:30:49,209 - INFO - Retry 0
2026-10-05 04:30:49,209 - DEBUG - Running remote_cmd, Cmd : wget http://169.254.1.2:8083 --spider && echo "Successful", host_string: cirros@169.254.0.3, password: cubswin:)gateway: ubuntu@10.0.0.50, gateway password: c0ntrail123
2026-10-05 04:30:49,209 - DEBUG - wget http://169.254.1.2:8083 --spider && echo "Successful"
2026-10-05 04:30:51,150 - DEBUG - Connecting to 169.254.1.2:8083 (169.254.1.2:8083)
Successful
2026-10-05 04:30:51,150 - INFO - Generic metadata worked
2026-10-05 04:30:51,374 - DEBUG - Link local service introspect removed
2026-10-05 04:30:51,374 - INFO - Deleting VM ctest-TestBasicVMVN-06923401-76304352
2026-10-05 04:30:51,499 - INFO - Deleting VN ctest-vn2_metadata-84526223
2026-10-05 04:30:51,559 - DEBUG - VN 7ad20f25-646f-4e39-9655-0af8e542b809 still in use: Unable to complete operation on network 7ad20f25-646f-4e39-9655-0af8e542b809. There are one or more ports still in use on the network.
Neutron server returns request_ids: ['req-42c658da-d4b8-42c9-aaa1-9e13777a38a7']
2026-10-05 04:30:51,559 - WARNING - Deleting VN ctest-vn2_metadata-84526223 failed..Will retry
2026-10-05 04:30:53,623 - DEBUG - VN 7ad20f25-646f-4e39-9655-0af8e542b809 still in use: Unable to complete operation on network 7ad20f25-646f-4e39-9655-0af8e542b809. There are one or more ports still in use on the network.
Neutron server returns request_ids: ['req-fba6a08e-c90f-4165-8422-d44d47b76b17']
2026-10-05 04:30:53,623 - WARNING - Deleting VN ctest-vn2_metadata-84526223 failed..Will retry
2026-10-05 04:30:55,835 - DEBUG - Response for deleting network ()
2026-10-05 04:30:57,175 - DEBUG - No XMPP flaps were noticed during the test
2026-10-05 04:30:57,175 - INFO - END TEST : test_generic_link_local_service : PASSED[0:00:46]
2026-10-05 04:30:57,175 - INFO - --------------------------------------------------------------------------------
2026-10-05 04:30:57,180 - INFO - ================================================================================
2026-10-05 04:30:57,180 - INFO - STARTING TEST : test_metadata_service
2026-10-05 04:30:57,180 - INFO - TEST DESCRIPTION :
Description: Test to validate metadata service on VM creation.
1.Verify from global-vrouter-config if metadata configures or not - fails otherwise
2.Create a shell script which writes 'hello world ' in a file in /tmp and save the script on the nova api node
3.Create a vm with userdata pointing to that script - script should get executed during vm boot up
4.Go to the vm and verify if the file with 'hello world ' written saved in /tmp of the vm - fails otherwise
Maintainer: sandipd@juniper.net
2026-10-05 04:30:58,527 - DEBUG - Nothing to compare xmpp stats {'10.0.0.50': {'10.20.0.14': '0', '10.20.0.25': '0'}, '10.0.0.191': {'10.20.0.254': '0', '10.20.0.25': '0'}} with
2026-10-05 04:30:58,527 - INFO - Initial checks done. Running the testcase now
2026-10-05 04:30:58,527 - INFO -
2026-10-05 04:30:58,527 - DEBUG - Requesting: http://10.0.0.177:8082/global-vrouter-configs
2026-10-05 04:30:58,906 - DEBUG - Requesting: http://10.0.0.177:8082/global-vrouter-configs
2026-10-05 04:30:58,942 - DEBUG - Requesting: http://10.0.0.177:8082/global-vrouter-config/99a29984-cfa4-498b-befc-b129fd9161f4
2026-10-05 04:30:59,283 - DEBUG - Response for create_network : {'network': {'id': 'b123c14f-0f8f-44fd-80cb-47bb35e82fc0', 'name': 'ctest-vn-45544973', 'tenant_id': '8306610e8e6045ac92747e7784afdd15', 'project_id': '8306610e8e6045ac92747e7784afdd15', 'admin_state_up': True, 'shared': False, 'status': 'ACTIVE', 'router:external': False, 'mtu': 0, 'tags': [], 'subnets': [], 'fq_name': ['default-domain', 'ctest-TestBasicVMVN-06923401', 'ctest-vn-45544973'], 'port_security_enabled': True, 'description': ''}}
2026-10-05 04:30:59,566 - DEBUG - Response for create_subnet : {'subnet': {'id': '25c4c3a7-3d18-4d1d-87e2-82ae7a569aff', 'name': '', 'tenant_id': '8306610e8e6045ac92747e7784afdd15', 'network_id': 'b123c14f-0f8f-44fd-80cb-47bb35e82fc0', 'ip_version': 4, 'cidr': '93.169.192.128/26', 'allocation_pools': [{'start': '93.169.192.130', 'end': '93.169.192.190'}], 'gateway_ip': '93.169.192.129', 'enable_dhcp': True, 'ipv6_ra_mode': None, 'ipv6_address_mode': None, 'dns_nameservers': [], 'host_routes': [], 'dns_server_address': '93.169.192.130', 'tags': [], 'project_id': '8306610e8e6045ac92747e7784afdd15'}}
2026-10-05 04:30:59,591 - INFO - Created VN ctest-vn-45544973
2026-10-05 04:30:59,606 - DEBUG - VN ctest-vn-45544973 UUID is b123c14f-0f8f-44fd-80cb-47bb35e82fc0
2026-10-05 04:31:00,383 - INFO - VM ([]) created on node: (an-jenkins-deploy-platform-ansible-os-6343-2), Zone: (nova:an-jenkins-deploy-platform-ansible-os-6343-2)
2026-10-05 04:31:00,383 - INFO - Waiting for VM ctest-TestBasicVMVN-06923401-51247530 to be up..
2026-10-05 04:31:00,441 - DEBUG - VM is still in BUILD state, Expected: ACTIVE
2026-10-05 04:31:05,505 - DEBUG - VM is still in BUILD state, Expected: ACTIVE
2026-10-05 04:31:10,570 - DEBUG - VM is still in BUILD state, Expected: ACTIVE
2026-10-05 04:31:15,632 - DEBUG - VM is still in BUILD state, Expected: ACTIVE
2026-10-05 04:31:20,692 - DEBUG - VM is still in BUILD state, Expected: ACTIVE
2026-10-05 04:31:25,819 - DEBUG - VM is still in BUILD state, Expected: ACTIVE
2026-10-05 04:31:30,881 - DEBUG - VM is still in BUILD state, Expected: ACTIVE
2026-10-05 04:31:35,940 - DEBUG - VM is still in BUILD state, Expected: ACTIVE
2026-10-05 04:31:41,008 - DEBUG - VM is still in BUILD state, Expected: ACTIVE
2026-10-05 04:31:46,071 - DEBUG - VM is still in BUILD state, Expected: ACTIVE
2026-10-05 04:31:51,130 - DEBUG - VM is still in BUILD state, Expected: ACTIVE
2026-10-05 04:31:56,194 - DEBUG - VM is still in BUILD state, Expected: ACTIVE
2026-10-05 04:32:01,257 - DEBUG - VM is still in BUILD state, Expected: ACTIVE
2026-10-05 04:32:06,324 - DEBUG - VM is still in BUILD state, Expected: ACTIVE
2026-10-05 04:32:11,395 - DEBUG - VM is still in BUILD state, Expected: ACTIVE
2026-10-05 04:32:16,458 - DEBUG - VM is still in BUILD state, Expected: ACTIVE
2026-10-05 04:32:21,518 - DEBUG - VM is still in BUILD state, Expected: ACTIVE
2026-10-05 04:32:26,581 - DEBUG - VM is still in BUILD state, Expected: ACTIVE
2026-10-05 04:32:31,635 - DEBUG - VM is still in BUILD state, Expected: ACTIVE
2026-10-05 04:32:36,695 - DEBUG - VM is still in BUILD state, Expected: ACTIVE
2026-10-05 04:32:41,752 - DEBUG - VM is still in BUILD state, Expected: ACTIVE
2026-10-05 04:32:46,809 - DEBUG - VM is still in BUILD state, Expected: ACTIVE
2026-10-05 04:32:51,866 - DEBUG - VM is still in BUILD state, Expected: ACTIVE
2026-10-05 04:32:56,923 - DEBUG - VM is still in BUILD state, Expected: ACTIVE
2026-10-05 04:33:01,980 - DEBUG - VM is still in BUILD state, Expected: ACTIVE
2026-10-05 04:33:07,044 - DEBUG - VM is still in BUILD state, Expected: ACTIVE
2026-10-05 04:33:12,101 - DEBUG - VM is still in BUILD state, Expected: ACTIVE
2026-10-05 04:33:17,163 - DEBUG - VM is still in BUILD state, Expected: ACTIVE
2026-10-05 04:33:22,222 - DEBUG - VM is still in BUILD state, Expected: ACTIVE
2026-10-05 04:33:27,308 - DEBUG - VM is still in BUILD state, Expected: ACTIVE
2026-10-05 04:33:32,368 - DEBUG - VM is still in BUILD state, Expected: ACTIVE
2026-10-05 04:33:32,368 - ERROR - VM is not in ACTIVE state
2026-10-05 04:33:32,456 - ERROR - Fatal Nova Exception while getting VM detail
2026-10-05 04:33:32,456 - DEBUG - None
2026-10-05 04:33:32,459 - INFO - Skip interface_detach for VM ctest-TestBasicVMVN-06923401-51247530 in state BUILD
2026-10-05 04:33:32,459 - INFO - Deleting VM ctest-TestBasicVMVN-06923401-51247530
2026-10-05 04:33:32,459 - ERROR - VM ctest-TestBasicVMVN-06923401-51247530 has failed to come up
2026-10-05 04:33:32,459 - ERROR - Nova failed to get host of the VM
2026-10-05 04:33:32,459 - ERROR - VM ctest-TestBasicVMVN-06923401-51247530 has failed to come up
2026-10-05 04:33:32,459 - ERROR - Nova failed to get host of the VM
2026-10-05 04:33:32,615 - INFO - Deleting VN ctest-vn-45544973
2026-10-05 04:33:32,805 - DEBUG - Response for deleting network ()
2026-10-05 04:33:34,105 - ERROR - AssertionError
Python 3.9.25: /usr/bin/python3
Mon Oct 5 04:33:32 2026
A problem occurred in a Python script. Here is the sequence of
function calls leading up to the error, in the order they occurred.
/contrail-test/tcutils/wrappers.py in wrapper(self=, *args=(), **kwargs={})
78 log.info('Initial checks done. Running the testcase now')
79 log.info('')
80 result = function(self, *args, **kwargs)
81 if self.inputs.upgrade:
82 pid = os.getpid()
result = None
function =
self =
args = ()
kwargs = {}
/contrail-test/scripts/vm_regression/test_vm_basic.py in test_metadata_service(self=)
55 image_name='cirros',
56 userdata='/tmp/metadata_script.txt')
57 assert vm1_fixture.wait_till_vm_is_up()
58
59 cmd = 'cat /tmp/output.txt'
vm1_fixture =
vm1_fixture.wait_till_vm_is_up = >
AssertionError:
__cause__ = None
__class__ =
__context__ = None
__delattr__ =
__dict__ = {}
__dir__ =
__doc__ = 'Assertion failed.'
__eq__ =
__format__ =
__ge__ =
__getattribute__ =
__gt__ =
__hash__ =
__init__ =
__init_subclass__ =
__le__ =
__lt__ =
__ne__ =
__new__ =
__reduce__ =
__reduce_ex__ =
__repr__ =
__setattr__ =
__setstate__ =
__sizeof__ =
__str__ =
__subclasshook__ =
__suppress_context__ = False
__traceback__ =
args = ()
with_traceback =
The above is a description of an error in a Python program. Here is
the original traceback:
Traceback (most recent call last):
File "/contrail-test/tcutils/wrappers.py", line 80, in wrapper
result = function(self, *args, **kwargs)
File "/contrail-test/scripts/vm_regression/test_vm_basic.py", line 57, in test_metadata_service
assert vm1_fixture.wait_till_vm_is_up()
AssertionError
2026-10-05 04:33:34,120 - DEBUG - No XMPP flaps were noticed during the test
2026-10-05 04:33:34,120 - INFO -
2026-10-05 04:33:34,120 - INFO - END TEST : test_metadata_service : FAILED[0:02:37]
2026-10-05 04:33:34,120 - INFO - --------------------------------------------------------------------------------
2026-10-05 04:33:34,123 - INFO - ================================================================================
2026-10-05 04:33:34,123 - INFO - STARTING TEST : test_ping_within_vn_two_vms_two_different_subnets
2026-10-05 04:33:34,123 - INFO - TEST DESCRIPTION :
Description: Validate Ping between 2 VMs in the same VN, 2 VMs in different VN
subnets.
Test steps:
1. Create 1 IPAM's.
2. Create 1 VN with 2 subnets and launch 2 VMs in them.
3. Ping between the VMs in the same VN should go thru fine.
4. Ping to the subnet broadcast and all-broadcast address.
Pass criteria: VM in the same subnet will respond to both the pings, while the VM in a different VN should respond only to the
all-broadcast address.
Maintainer : ganeshahv@juniper.net
2026-10-05 04:33:35,419 - DEBUG - Nothing to compare xmpp stats {'10.0.0.50': {'10.20.0.14': '0', '10.20.0.25': '0'}, '10.0.0.191': {'10.20.0.254': '0', '10.20.0.25': '0'}} with
2026-10-05 04:33:35,419 - INFO - Initial checks done. Running the testcase now
2026-10-05 04:33:35,419 - INFO -
2026-10-05 04:33:36,067 - DEBUG - Response for create_network : {'network': {'id': '61a0cdf0-f8f1-4d93-b28d-6c7e526bf7e8', 'name': 'ctest-vn-27290969', 'tenant_id': '8306610e8e6045ac92747e7784afdd15', 'project_id': '8306610e8e6045ac92747e7784afdd15', 'admin_state_up': True, 'shared': False, 'status': 'ACTIVE', 'router:external': False, 'mtu': 0, 'tags': [], 'subnets': [], 'fq_name': ['default-domain', 'ctest-TestBasicVMVN-06923401', 'ctest-vn-27290969'], 'port_security_enabled': True, 'description': ''}}
2026-10-05 04:33:36,310 - DEBUG - Response for create_subnet : {'subnet': {'id': 'c5805b7a-c4fe-4e00-9b5d-a62f026f11d7', 'name': '', 'tenant_id': '8306610e8e6045ac92747e7784afdd15', 'network_id': '61a0cdf0-f8f1-4d93-b28d-6c7e526bf7e8', 'ip_version': 4, 'cidr': '31.1.1.0/29', 'allocation_pools': [{'start': '31.1.1.2', 'end': '31.1.1.6'}], 'gateway_ip': '31.1.1.1', 'enable_dhcp': True, 'ipv6_ra_mode': None, 'ipv6_address_mode': None, 'dns_nameservers': [], 'host_routes': [], 'dns_server_address': '31.1.1.2', 'tags': [], 'project_id': '8306610e8e6045ac92747e7784afdd15'}}
2026-10-05 04:33:36,603 - DEBUG - Response for create_subnet : {'subnet': {'id': 'c367ce08-3d58-4e04-aa6d-a15dc278f57d', 'name': '', 'tenant_id': '8306610e8e6045ac92747e7784afdd15', 'network_id': '61a0cdf0-f8f1-4d93-b28d-6c7e526bf7e8', 'ip_version': 4, 'cidr': '31.1.2.0/29', 'allocation_pools': [{'start': '31.1.2.2', 'end': '31.1.2.6'}], 'gateway_ip': '31.1.2.1', 'enable_dhcp': True, 'ipv6_ra_mode': None, 'ipv6_address_mode': None, 'dns_nameservers': [], 'host_routes': [], 'dns_server_address': '31.1.2.2', 'tags': [], 'project_id': '8306610e8e6045ac92747e7784afdd15'}}
2026-10-05 04:33:36,647 - INFO - Created VN ctest-vn-27290969
2026-10-05 04:33:36,664 - DEBUG - VN ctest-vn-27290969 UUID is 61a0cdf0-f8f1-4d93-b28d-6c7e526bf7e8
2026-10-05 04:33:37,166 - DEBUG - Response for create_port : {'port': {'name': 'b504b123-5a64-41b9-bbd0-a96585949409', 'id': 'b504b123-5a64-41b9-bbd0-a96585949409', 'tenant_id': '8306610e8e6045ac92747e7784afdd15', 'network_id': '61a0cdf0-f8f1-4d93-b28d-6c7e526bf7e8', 'mac_address': '02:b5:04:b1:23:5a', 'binding:vnic_type': 'normal', 'binding:vif_details': {'port_filter': True}, 'binding:vif_type': 'unbound', 'binding:host_id': None, 'allowed_address_pairs': [], 'fixed_ips': [{'ip_address': '31.1.1.4', 'subnet_id': 'c5805b7a-c4fe-4e00-9b5d-a62f026f11d7'}], 'security_groups': ['c66fa6be-8d89-46e0-867e-e7227c395f2d'], 'admin_state_up': True, 'device_id': '', 'device_owner': '', 'status': 'DOWN', 'tags': [], 'port_security_enabled': True, 'description': '', 'project_id': '8306610e8e6045ac92747e7784afdd15'}}
2026-10-05 04:33:37,456 - DEBUG - Response for create_port : {'port': {'name': 'ad9872bc-dd40-4007-af00-56974dea516d', 'id': 'ad9872bc-dd40-4007-af00-56974dea516d', 'tenant_id': '8306610e8e6045ac92747e7784afdd15', 'network_id': '61a0cdf0-f8f1-4d93-b28d-6c7e526bf7e8', 'mac_address': '02:ad:98:72:bc:dd', 'binding:vnic_type': 'normal', 'binding:vif_details': {'port_filter': True}, 'binding:vif_type': 'unbound', 'binding:host_id': None, 'allowed_address_pairs': [], 'fixed_ips': [{'ip_address': '31.1.2.4', 'subnet_id': 'c367ce08-3d58-4e04-aa6d-a15dc278f57d'}], 'security_groups': ['c66fa6be-8d89-46e0-867e-e7227c395f2d'], 'admin_state_up': True, 'device_id': '', 'device_owner': '', 'status': 'DOWN', 'tags': [], 'port_security_enabled': True, 'description': '', 'project_id': '8306610e8e6045ac92747e7784afdd15'}}
2026-10-05 04:33:38,170 - INFO - VM ([]) created on node: (an-jenkins-deploy-platform-ansible-os-6343-1), Zone: (nova:an-jenkins-deploy-platform-ansible-os-6343-1)
2026-10-05 04:33:38,830 - INFO - VM ([]) created on node: (an-jenkins-deploy-platform-ansible-os-6343-2), Zone: (nova:an-jenkins-deploy-platform-ansible-os-6343-2)
2026-10-05 04:33:39,562 - INFO - VM ([]) created on node: (an-jenkins-deploy-platform-ansible-os-6343-1), Zone: (nova:an-jenkins-deploy-platform-ansible-os-6343-1)
2026-10-05 04:33:39,562 - DEBUG - Requesting: http://10.0.0.177:8082/domains
2026-10-05 04:33:39,569 - DEBUG - Requesting: http://10.0.0.177:8082/domain/6850e378-7089-4036-8f54-55c0ed1b9054
2026-10-05 04:33:39,588 - DEBUG - Requesting: http://10.0.0.177:8082/project/8306610e-8e60-45ac-9274-7e7784afdd15
2026-10-05 04:33:39,712 - DEBUG - Requesting: http://10.0.0.177:8082/network-ipam/bbea838c-6de2-4d45-8ed8-d60dbaae6f4d
2026-10-05 04:33:39,725 - INFO - Verifications in API Server for IPAM: ctest-ipam-87054525 passed
2026-10-05 04:33:39,734 - DEBUG - Control-node 10.0.0.177 : IPAM object is : {'node_name': 'network-ipam:default-domain:ctest-TestBasicVMVN-06923401:ctest-ipam-87054525', 'interests': '-', 'advertised': '-', 'dbentryflags': None, 'obj_info': {'sequence_number': '0', 'origin': 'Cassandra', 'data': {'id-perms': {'permissions': {'owner': 'ctest-TestBasicVMVN-06923401', 'owner-access': '7', 'group': 'reader', 'group-access': '7', 'other-access': '7'}, 'uuid': {'uuid-mslong': '13540779868805025093', 'uuid-lslong': '10293212302810181453'}, 'enable': 'true', 'created': '2026-10-05T04:33:35', 'last-modified': '2026-10-05T04:33:35', 'description': None, 'user-visible': 'true', 'creator': None}}}, 'neighbors': None, 'last_modified': '00:00:04.039863'}
2026-10-05 04:33:39,744 - DEBUG - Control-node 10.0.0.38 : IPAM object is : {'node_name': 'network-ipam:default-domain:ctest-TestBasicVMVN-06923401:ctest-ipam-87054525', 'interests': '-', 'advertised': '-', 'dbentryflags': None, 'obj_info': {'sequence_number': '0', 'origin': 'Cassandra', 'data': {'id-perms': {'permissions': {'owner': 'ctest-TestBasicVMVN-06923401', 'owner-access': '7', 'group': 'reader', 'group-access': '7', 'other-access': '7'}, 'uuid': {'uuid-mslong': '13540779868805025093', 'uuid-lslong': '10293212302810181453'}, 'enable': 'true', 'created': '2026-10-05T04:33:35', 'last-modified': '2026-10-05T04:33:35', 'description': None, 'user-visible': 'true', 'creator': None}}}, 'neighbors': None, 'last_modified': '00:00:04.050531'}
2026-10-05 04:33:39,751 - DEBUG - Control-node 10.0.0.190 : IPAM object is : {'node_name': 'network-ipam:default-domain:ctest-TestBasicVMVN-06923401:ctest-ipam-87054525', 'interests': '-', 'advertised': '-', 'dbentryflags': None, 'obj_info': {'sequence_number': '0', 'origin': 'Cassandra', 'data': {'id-perms': {'permissions': {'owner': 'ctest-TestBasicVMVN-06923401', 'owner-access': '7', 'group': 'reader', 'group-access': '7', 'other-access': '7'}, 'uuid': {'uuid-mslong': '13540779868805025093', 'uuid-lslong': '10293212302810181453'}, 'enable': 'true', 'created': '2026-10-05T04:33:35', 'last-modified': '2026-10-05T04:33:35', 'description': None, 'user-visible': 'true', 'creator': None}}}, 'neighbors': None, 'last_modified': '00:00:04.059176'}
2026-10-05 04:33:39,751 - INFO - Verifications in Control node for IPAM: ctest-ipam-87054525 passed
2026-10-05 04:33:39,751 - DEBUG - Requesting: http://10.0.0.177:8082/domains
2026-10-05 04:33:39,759 - DEBUG - Requesting: http://10.0.0.177:8082/domain/6850e378-7089-4036-8f54-55c0ed1b9054
2026-10-05 04:33:39,772 - DEBUG - Requesting: http://10.0.0.177:8082/project/8306610e-8e60-45ac-9274-7e7784afdd15
2026-10-05 04:33:39,873 - DEBUG - Requesting: http://10.0.0.177:8082/virtual-network/61a0cdf0-f8f1-4d93-b28d-6c7e526bf7e8
2026-10-05 04:33:39,892 - DEBUG - Requesting: http://10.0.0.177:8082/virtual-network/61a0cdf0-f8f1-4d93-b28d-6c7e526bf7e8
2026-10-05 04:33:39,907 - DEBUG - Requesting: http://10.0.0.177:8082/routing-instance/224789ec-482f-4559-8dd4-983d4fc76f28
2026-10-05 04:33:39,925 - DEBUG - Requesting: http://10.0.0.177:8082/routing-instance/224789ec-482f-4559-8dd4-983d4fc76f28
2026-10-05 04:33:39,940 - DEBUG - Requesting: http://10.0.0.177:8082/route-target/591a5e43-0573-49cb-8189-c306f8945cf7
2026-10-05 04:33:39,951 - DEBUG - Route Targets: ['target:64512:8000010']
2026-10-05 04:33:39,951 - DEBUG - Requesting: http://10.0.0.177:8082/virtual-network/61a0cdf0-f8f1-4d93-b28d-6c7e526bf7e8
2026-10-05 04:33:39,969 - DEBUG - Requesting: http://10.0.0.177:8082/routing-instance/224789ec-482f-4559-8dd4-983d4fc76f28
2026-10-05 04:33:39,991 - INFO - Verified VN network id 19 for VN 61a0cdf0-f8f1-4d93-b28d-6c7e526bf7e8
2026-10-05 04:33:39,992 - INFO - Verifications in API Server for VN ctest-vn-27290969 passed
2026-10-05 04:33:39,992 - DEBUG - Requesting: http://10.0.0.177:8082/virtual-network/61a0cdf0-f8f1-4d93-b28d-6c7e526bf7e8
2026-10-05 04:33:40,004 - DEBUG - Requesting: http://10.0.0.177:8082/routing-instance/224789ec-482f-4559-8dd4-983d4fc76f28
2026-10-05 04:33:40,015 - DEBUG - Requesting: http://10.0.0.177:8082/routing-instance/224789ec-482f-4559-8dd4-983d4fc76f28
2026-10-05 04:33:40,030 - DEBUG - Requesting: http://10.0.0.177:8082/route-target/591a5e43-0573-49cb-8189-c306f8945cf7
2026-10-05 04:33:40,049 - DEBUG - Control-node 10.0.0.177 : VN object is : {'node_name': 'virtual-network:default-domain:ctest-TestBasicVMVN-06923401:ctest-vn-27290969', 'interests': '-', 'advertised': '-', 'dbentryflags': None, 'obj_info': {'sequence_number': '0', 'origin': 'Cassandra', 'data': {'id-perms': {'permissions': {'owner': 'ctest-TestBasicVMVN-06923401', 'owner-access': '7', 'group': 'reader', 'group-access': '7', 'other-access': '7'}, 'uuid': {'uuid-mslong': '7034849052805123475', 'uuid-lslong': '12866059000271861736'}, 'enable': 'true', 'created': '2026-10-05T04:33:36', 'last-modified': '2026-10-05T04:33:36', 'description': None, 'user-visible': 'true', 'creator': None}}}, 'neighbors': None, 'last_modified': '00:00:03.515249'}
2026-10-05 04:33:40,057 - DEBUG - Route Targets: ['target:64512:8000010']
2026-10-05 04:33:40,065 - DEBUG - Control-node 10.0.0.38 : VN object is : {'node_name': 'virtual-network:default-domain:ctest-TestBasicVMVN-06923401:ctest-vn-27290969', 'interests': '-', 'advertised': '-', 'dbentryflags': None, 'obj_info': {'sequence_number': '0', 'origin': 'Cassandra', 'data': {'id-perms': {'permissions': {'owner': 'ctest-TestBasicVMVN-06923401', 'owner-access': '7', 'group': 'reader', 'group-access': '7', 'other-access': '7'}, 'uuid': {'uuid-mslong': '7034849052805123475', 'uuid-lslong': '12866059000271861736'}, 'enable': 'true', 'created': '2026-10-05T04:33:36', 'last-modified': '2026-10-05T04:33:36', 'description': None, 'user-visible': 'true', 'creator': None}}}, 'neighbors': None, 'last_modified': '00:00:03.538203'}
2026-10-05 04:33:40,074 - DEBUG - Route Targets: ['target:64512:8000010']
2026-10-05 04:33:40,081 - DEBUG - Control-node 10.0.0.190 : VN object is : {'node_name': 'virtual-network:default-domain:ctest-TestBasicVMVN-06923401:ctest-vn-27290969', 'interests': '-', 'advertised': '-', 'dbentryflags': None, 'obj_info': {'sequence_number': '0', 'origin': 'Cassandra', 'data': {'id-perms': {'permissions': {'owner': 'ctest-TestBasicVMVN-06923401', 'owner-access': '7', 'group': 'reader', 'group-access': '7', 'other-access': '7'}, 'uuid': {'uuid-mslong': '7034849052805123475', 'uuid-lslong': '12866059000271861736'}, 'enable': 'true', 'created': '2026-10-05T04:33:36', 'last-modified': '2026-10-05T04:33:36', 'description': None, 'user-visible': 'true', 'creator': None}}}, 'neighbors': None, 'last_modified': '00:00:03.552617'}
2026-10-05 04:33:40,088 - DEBUG - Route Targets: ['target:64512:8000010']
2026-10-05 04:33:40,088 - INFO - On all control nodes, Config, RI and RT verification for VN ctest-vn-27290969 passed
2026-10-05 04:33:40,088 - DEBUG - ====Verifying policy data for ctest-vn-27290969 in API_Server ======
2026-10-05 04:33:40,088 - DEBUG - Requesting: http://10.0.0.177:8082/domains
2026-10-05 04:33:40,096 - DEBUG - Requesting: http://10.0.0.177:8082/domain/6850e378-7089-4036-8f54-55c0ed1b9054
2026-10-05 04:33:40,110 - DEBUG - Requesting: http://10.0.0.177:8082/project/8306610e-8e60-45ac-9274-7e7784afdd15
2026-10-05 04:33:40,229 - DEBUG - Requesting: http://10.0.0.177:8082/virtual-network/61a0cdf0-f8f1-4d93-b28d-6c7e526bf7e8
2026-10-05 04:33:40,241 - DEBUG - =>VN ctest-vn-27290969 has no policy to be verified
2026-10-05 04:33:40,242 - DEBUG - Verifying the vn in opserver
2026-10-05 04:33:40,242 - DEBUG - Verifying the default-domain:ctest-TestBasicVMVN-06923401:ctest-vn-27290969 virtual network link through opserver 10.0.0.177
2026-10-05 04:33:40,242 - DEBUG - Requesting: http://10.0.0.177:8081/analytics/uves/virtual-networks
2026-10-05 04:33:40,624 - DEBUG - Requesting: http://10.0.0.177:8081/analytics/uves/virtual-networks
2026-10-05 04:33:40,699 - DEBUG - vn link and name as {'name': 'default-domain:ctest-TestBasicVMVN-06923401:ctest-vn-27290969', 'href': 'http://10.0.0.177:8081/analytics/uves/virtual-network/default-domain:ctest-TestBasicVMVN-06923401:ctest-vn-27290969?flat'}
2026-10-05 04:33:40,700 - DEBUG - Verifying the default-domain:ctest-TestBasicVMVN-06923401:ctest-vn-27290969 virtual network link through opserver 10.0.0.38
2026-10-05 04:33:40,700 - DEBUG - Requesting: http://10.0.0.38:8081/analytics/uves/virtual-networks
2026-10-05 04:33:41,104 - DEBUG - Requesting: http://10.0.0.38:8081/analytics/uves/virtual-networks
2026-10-05 04:33:41,169 - DEBUG - vn link and name as {'name': 'default-domain:ctest-TestBasicVMVN-06923401:ctest-vn-27290969', 'href': 'http://10.0.0.38:8081/analytics/uves/virtual-network/default-domain:ctest-TestBasicVMVN-06923401:ctest-vn-27290969?flat'}
2026-10-05 04:33:41,169 - DEBUG - Verifying the default-domain:ctest-TestBasicVMVN-06923401:ctest-vn-27290969 virtual network link through opserver 10.0.0.190
2026-10-05 04:33:41,169 - DEBUG - Requesting: http://10.0.0.190:8081/analytics/uves/virtual-networks
2026-10-05 04:33:41,561 - DEBUG - Requesting: http://10.0.0.190:8081/analytics/uves/virtual-networks
2026-10-05 04:33:41,627 - DEBUG - vn link and name as {'name': 'default-domain:ctest-TestBasicVMVN-06923401:ctest-vn-27290969', 'href': 'http://10.0.0.190:8081/analytics/uves/virtual-network/default-domain:ctest-TestBasicVMVN-06923401:ctest-vn-27290969?flat'}
2026-10-05 04:33:41,627 - INFO - Validated that VN default-domain:ctest-TestBasicVMVN-06923401:ctest-vn-27290969 is found in opserver
2026-10-05 04:33:41,658 - DEBUG - Do not have enough data to verify VN in agent
2026-10-05 04:33:41,673 - DEBUG - VRF ids for VN ctest-vn-27290969: {}
2026-10-05 04:33:41,673 - INFO - Waiting for VM ctest-TestBasicVMVN-06923401-41836732 to be up..
2026-10-05 04:33:41,735 - DEBUG - VM is still in BUILD state, Expected: ACTIVE
2026-10-05 04:33:46,831 - DEBUG - VM is still in BUILD state, Expected: ACTIVE
2026-10-05 04:33:51,930 - DEBUG - VM is still in BUILD state, Expected: ACTIVE
2026-10-05 04:33:57,046 - DEBUG - VM is still in BUILD state, Expected: ACTIVE
2026-10-05 04:34:02,145 - DEBUG - VM is still in BUILD state, Expected: ACTIVE
2026-10-05 04:34:07,241 - DEBUG - VM is still in BUILD state, Expected: ACTIVE
2026-10-05 04:34:12,350 - DEBUG - VM is still in BUILD state, Expected: ACTIVE
2026-10-05 04:34:17,446 - DEBUG - VM is still in BUILD state, Expected: ACTIVE
2026-10-05 04:34:22,546 - DEBUG - VM is in ACTIVE state now
2026-10-05 04:34:22,546 - INFO - VM name : ctest-TestBasicVMVN-06923401-41836732
2026-10-05 04:34:22,638 - DEBUG - VM ctest-TestBasicVMVN-06923401-41836732 ID is c3698ae8-0ac6-4958-a55b-e68f7bcf1c48
2026-10-05 04:34:22,638 - DEBUG - VM ctest-TestBasicVMVN-06923401-41836732 launched on Node an-jenkins-deploy-platform-ansible-os-6343-1
2026-10-05 04:34:22,736 - DEBUG - Requesting: http://10.0.0.190:8082/virtual-machine/c3698ae8-0ac6-4958-a55b-e68f7bcf1c48
2026-10-05 04:34:22,748 - DEBUG - Requesting: http://10.0.0.190:8082/virtual-machine-interface/b504b123-5a64-41b9-bbd0-a96585949409
2026-10-05 04:34:25,955 - DEBUG - (True, 'PING 169.254.0.3 (169.254.0.3) 56(84) bytes of data.\r\n\r\n--- 169.254.0.3 ping statistics ---\r\n2 packets transmitted, 0 received, 100% packet loss, time 1027ms')
2026-10-05 04:34:25,955 - DEBUG - Ping to Metadata IP 169.254.0.3 of VM ctest-TestBasicVMVN-06923401-41836732 failed!
2026-10-05 04:34:25,972 - DEBUG - Gateway for vn default-domain:ctest-TestBasicVMVN-06923401:ctest-vn-27290969 is 31.1.1.1 and allocation pool is NOT set
2026-10-05 04:34:25,973 - DEBUG - Gateway for vn default-domain:ctest-TestBasicVMVN-06923401:ctest-vn-27290969 is 31.1.2.1 and allocation pool is NOT set
2026-10-05 04:34:30,051 - DEBUG - (True, 'PING 169.254.0.3 (169.254.0.3) 56(84) bytes of data.\r\n64 bytes from 169.254.0.3: icmp_seq=2 ttl=63 time=10.8 ms\r\n\r\n--- 169.254.0.3 ping statistics ---\r\n2 packets transmitted, 1 received, 50% packet loss, time 1013ms\r\nrtt min/avg/max/mdev = 10.773/10.773/10.773/0.000 ms')
2026-10-05 04:34:30,052 - INFO - Ping to Metadata IP 169.254.0.3 of VM ctest-TestBasicVMVN-06923401-41836732 passed
2026-10-05 04:34:30,129 - DEBUG - verify_vm_launched is skipped since self.vm_launch_flag is set
2026-10-05 04:34:30,129 - DEBUG - Waiting to SSH to VM ctest-TestBasicVMVN-06923401-41836732, IP 31.1.1.4, Port 22
2026-10-05 04:34:30,312 - DEBUG - VM ctest-TestBasicVMVN-06923401-41836732 is ready for SSH connections
2026-10-05 04:34:30,313 - INFO - Waiting for VM ctest-TestBasicVMVN-06923401-91594560 to be up..
2026-10-05 04:34:30,379 - DEBUG - VM is still in BUILD state, Expected: ACTIVE
2026-10-05 04:34:35,445 - DEBUG - VM is still in BUILD state, Expected: ACTIVE
2026-10-05 04:34:40,503 - DEBUG - VM is still in BUILD state, Expected: ACTIVE
2026-10-05 04:34:45,562 - DEBUG - VM is still in BUILD state, Expected: ACTIVE
2026-10-05 04:34:50,622 - DEBUG - VM is still in BUILD state, Expected: ACTIVE
2026-10-05 04:34:55,686 - DEBUG - VM is still in BUILD state, Expected: ACTIVE
2026-10-05 04:35:00,749 - DEBUG - VM is still in BUILD state, Expected: ACTIVE
2026-10-05 04:35:05,813 - DEBUG - VM is still in BUILD state, Expected: ACTIVE
2026-10-05 04:35:10,876 - DEBUG - VM is still in BUILD state, Expected: ACTIVE
2026-10-05 04:35:15,988 - DEBUG - VM is still in BUILD state, Expected: ACTIVE
2026-10-05 04:35:21,100 - DEBUG - VM is still in BUILD state, Expected: ACTIVE
2026-10-05 04:35:26,205 - DEBUG - VM is still in BUILD state, Expected: ACTIVE
2026-10-05 04:35:31,263 - DEBUG - VM is still in BUILD state, Expected: ACTIVE
2026-10-05 04:35:36,326 - DEBUG - VM is still in BUILD state, Expected: ACTIVE
2026-10-05 04:35:41,389 - DEBUG - VM is still in BUILD state, Expected: ACTIVE
2026-10-05 04:35:46,454 - DEBUG - VM is still in BUILD state, Expected: ACTIVE
2026-10-05 04:35:51,511 - DEBUG - VM is still in BUILD state, Expected: ACTIVE
2026-10-05 04:35:56,575 - DEBUG - VM is still in BUILD state, Expected: ACTIVE
2026-10-05 04:36:01,642 - DEBUG - VM is still in BUILD state, Expected: ACTIVE
2026-10-05 04:36:06,703 - DEBUG - VM is still in BUILD state, Expected: ACTIVE
2026-10-05 04:36:11,796 - DEBUG - VM is still in BUILD state, Expected: ACTIVE
2026-10-05 04:36:16,862 - DEBUG - VM is still in BUILD state, Expected: ACTIVE
2026-10-05 04:36:21,926 - DEBUG - VM is still in BUILD state, Expected: ACTIVE
2026-10-05 04:36:27,077 - DEBUG - VM is still in BUILD state, Expected: ACTIVE
2026-10-05 04:36:32,138 - DEBUG - VM is still in BUILD state, Expected: ACTIVE
2026-10-05 04:36:37,199 - DEBUG - VM is still in BUILD state, Expected: ACTIVE
2026-10-05 04:36:42,258 - DEBUG - VM is still in BUILD state, Expected: ACTIVE
2026-10-05 04:36:47,322 - DEBUG - VM is still in BUILD state, Expected: ACTIVE
2026-10-05 04:36:52,384 - DEBUG - VM is still in BUILD state, Expected: ACTIVE
2026-10-05 04:36:57,447 - DEBUG - VM is still in BUILD state, Expected: ACTIVE
2026-10-05 04:37:02,505 - DEBUG - VM is still in BUILD state, Expected: ACTIVE
2026-10-05 04:37:02,506 - ERROR - VM is not in ACTIVE state
2026-10-05 04:37:02,588 - ERROR - Fatal Nova Exception while getting VM detail
2026-10-05 04:37:02,588 - DEBUG - None
2026-10-05 04:37:02,590 - INFO - Skip interface_detach for VM ctest-TestBasicVMVN-06923401-40834428 in state BUILD
2026-10-05 04:37:02,590 - INFO - Deleting VM ctest-TestBasicVMVN-06923401-40834428
2026-10-05 04:37:02,590 - ERROR - VM ctest-TestBasicVMVN-06923401-40834428 has failed to come up
2026-10-05 04:37:02,590 - ERROR - Nova failed to get host of the VM
2026-10-05 04:37:02,590 - ERROR - VM ctest-TestBasicVMVN-06923401-40834428 has failed to come up
2026-10-05 04:37:02,590 - ERROR - Nova failed to get host of the VM
2026-10-05 04:37:02,673 - INFO - Skip interface_detach for VM ctest-TestBasicVMVN-06923401-91594560 in state BUILD
2026-10-05 04:37:02,673 - INFO - Deleting VM ctest-TestBasicVMVN-06923401-91594560
2026-10-05 04:37:02,673 - ERROR - VM ctest-TestBasicVMVN-06923401-91594560 has failed to come up
2026-10-05 04:37:02,673 - ERROR - Nova failed to get host of the VM
2026-10-05 04:37:02,673 - ERROR - VM ctest-TestBasicVMVN-06923401-91594560 has failed to come up
2026-10-05 04:37:02,673 - ERROR - Nova failed to get host of the VM
2026-10-05 04:37:02,833 - INFO - Detaching port b504b123-5a64-41b9-bbd0-a96585949409 from VM ctest-TestBasicVMVN-06923401-41836732
2026-10-05 04:37:02,880 - INFO - Deleting VM ctest-TestBasicVMVN-06923401-41836732
2026-10-05 04:37:02,964 - INFO - Deleting VN ctest-vn-27290969
2026-10-05 04:37:03,238 - DEBUG - Response for delete_port : ()
2026-10-05 04:37:03,459 - DEBUG - Response for delete_port : ()
2026-10-05 04:37:03,510 - DEBUG - VN 61a0cdf0-f8f1-4d93-b28d-6c7e526bf7e8 still in use: Unable to complete operation on network 61a0cdf0-f8f1-4d93-b28d-6c7e526bf7e8. There are one or more ports still in use on the network.
Neutron server returns request_ids: ['req-e0ceef60-dedf-42c3-b60a-5425cbd5557f']
2026-10-05 04:37:03,510 - WARNING - Deleting VN ctest-vn-27290969 failed..Will retry
2026-10-05 04:37:05,767 - DEBUG - Response for deleting network ()
2026-10-05 04:37:05,767 - DEBUG - Requesting: http://10.0.0.177:8082/routing-instance/224789ec-482f-4559-8dd4-983d4fc76f28
2026-10-05 04:37:05,819 - DEBUG - Response Code: 404
2026-10-05 04:37:05,819 - DEBUG - Requesting: http://10.0.0.177:8082/domains
2026-10-05 04:37:05,835 - DEBUG - Requesting: http://10.0.0.177:8082/domain/6850e378-7089-4036-8f54-55c0ed1b9054
2026-10-05 04:37:05,879 - DEBUG - Requesting: http://10.0.0.177:8082/project/8306610e-8e60-45ac-9274-7e7784afdd15
2026-10-05 04:37:05,983 - INFO - Validated that VN ctest-vn-27290969 is not found in API Server
2026-10-05 04:37:05,997 - DEBUG - VN ctest-vn-27290969 is not present in Agent 10.0.0.50
2026-10-05 04:37:06,020 - DEBUG - VN ctest-vn-27290969 is not present in Agent 10.0.0.191
2026-10-05 04:37:06,020 - INFO - Validated that VN ctest-vn-27290969 is not in any agent
2026-10-05 04:37:06,070 - INFO - Validated that Routing instances and Config db in Control-nodes does not have VN ctest-vn-27290969 info
2026-10-05 04:37:06,198 - INFO - IPAM: ctest-ipam-87054525 is not found in API Server
2026-10-05 04:37:06,231 - INFO - IPAM:ctest-ipam-87054525 is not found in control node
2026-10-05 04:37:07,541 - ERROR - AssertionError
Python 3.9.25: /usr/bin/python3
Mon Oct 5 04:37:02 2026
A problem occurred in a Python script. Here is the sequence of
function calls leading up to the error, in the order they occurred.
/contrail-test/tcutils/wrappers.py in wrapper(self=, *args=(), **kwargs={})
78 log.info('Initial checks done. Running the testcase now')
79 log.info('')
80 result = function(self, *args, **kwargs)
81 if self.inputs.upgrade:
82 pid = os.getpid()
result = None
function =
self =
args = ()
kwargs = {}
/contrail-test/scripts/vm_regression/test_vm_basic.py in test_ping_within_vn_two_vms_two_different_subnets(self=)
146 assert vn1_fixture.verify_on_setup()
147 assert vm1.wait_till_vm_is_up()
148 assert vm2.wait_till_vm_is_up()
149 assert vm3.wait_till_vm_is_up()
150 assert vm1.ping_to_ip(vm2.vm_ip)
vm2 =
vm2.wait_till_vm_is_up = >
AssertionError:
__cause__ = None
__class__ =
__context__ = None
__delattr__ =
__dict__ = {}
__dir__ =
__doc__ = 'Assertion failed.'
__eq__ =
__format__ =
__ge__ =
__getattribute__ =
__gt__ =
__hash__ =
__init__ =
__init_subclass__ =
__le__ =
__lt__ =
__ne__ =
__new__ =
__reduce__ =
__reduce_ex__ =
__repr__ =
__setattr__ =
__setstate__ =
__sizeof__ =
__str__ =
__subclasshook__ =
__suppress_context__ = False
__traceback__ =
args = ()
with_traceback =
The above is a description of an error in a Python program. Here is
the original traceback:
Traceback (most recent call last):
File "/contrail-test/tcutils/wrappers.py", line 80, in wrapper
result = function(self, *args, **kwargs)
File "/contrail-test/scripts/vm_regression/test_vm_basic.py", line 148, in test_ping_within_vn_two_vms_two_different_subnets
assert vm2.wait_till_vm_is_up()
AssertionError
2026-10-05 04:37:07,556 - DEBUG - No XMPP flaps were noticed during the test
2026-10-05 04:37:07,556 - INFO -
2026-10-05 04:37:07,556 - INFO - END TEST : test_ping_within_vn_two_vms_two_different_subnets : FAILED[0:03:33]
2026-10-05 04:37:07,556 - INFO - --------------------------------------------------------------------------------
2026-10-05 04:37:08,591 - INFO - Deleted project: ctest-TestBasicVMVN-06923401, ID : 8306610e-8e60-45ac-9274-7e7784afdd15