2026-10-05 03:59:16,388 - INFO - Domain Default found not creating
2026-10-05 03:59:16,606 - INFO - Project ctest-SecurityGroupBasicRegressionTests1_contrail-34544971 not found, creating it
2026-10-05 03:59:17,234 - INFO - Created Project:ctest-SecurityGroupBasicRegressionTests1_contrail-34544971, ID : cf2b70b2-743c-4124-b4b7-cb1262b0f677
2026-10-05 03:59:19,073 - INFO - ================================================================================
2026-10-05 03:59:19,073 - INFO - STARTING TEST : test_sec_group_basic
2026-10-05 03:59:19,073 - INFO - TEST DESCRIPTION :
Description: Test basic SG features
1. Security group create and delete
2. Create security group with custom rules and then update it for tcp
3. Launch VM with custom created security group and verify
4. Remove secuity group association with VM
5. Add back custom security group to VM and verify
6. Test with ping, which should fail
7. Test with TCP which should pass
8. Update the rules to allow icmp, ping should pass now
9. Delete security group while ports still reference it; SG is
detached from VMs and removed (Neutron and Contrail API)
2026-10-05 03:59:20,397 - DEBUG - Nothing to compare xmpp stats {'10.0.0.50': {'10.20.0.14': '0', '10.20.0.25': '0'}, '10.0.0.191': {'10.20.0.254': '0', '10.20.0.25': '0'}} with
2026-10-05 03:59:20,398 - INFO - Initial checks done. Running the testcase now
2026-10-05 03:59:20,398 - INFO -
2026-10-05 03:59:20,875 - INFO - Creating Security group: ['default-domain', 'ctest-SecurityGroupBasicRegressionTests1_contrail-34544971', 'ctest-test_sec_group-71175043']
2026-10-05 03:59:21,079 - DEBUG - Security group: ['default-domain', 'ctest-SecurityGroupBasicRegressionTests1_contrail-34544971', 'ctest-test_sec_group-71175043'] created succesfully
2026-10-05 03:59:21,080 - DEBUG - Requesting: http://10.0.0.177:8082/domains
2026-10-05 03:59:21,458 - DEBUG - Requesting: http://10.0.0.177:8082/domains
2026-10-05 03:59:21,500 - DEBUG - Requesting: http://10.0.0.177:8082/domain/6850e378-7089-4036-8f54-55c0ed1b9054
2026-10-05 03:59:21,520 - DEBUG - Requesting: http://10.0.0.177:8082/project/cf2b70b2-743c-4124-b4b7-cb1262b0f677
2026-10-05 03:59:21,658 - DEBUG - Requesting: http://10.0.0.177:8082/security-group/5edfc215-dad1-42ff-90c3-bda49def33ac
2026-10-05 03:59:21,684 - INFO - Security group ctest-test_sec_group-71175043 found in the API Server
2026-10-05 03:59:21,684 - DEBUG - Requesting: http://10.0.0.177:8082/domains
2026-10-05 03:59:21,691 - DEBUG - Requesting: http://10.0.0.177:8082/domain/6850e378-7089-4036-8f54-55c0ed1b9054
2026-10-05 03:59:21,704 - DEBUG - Requesting: http://10.0.0.177:8082/project/cf2b70b2-743c-4124-b4b7-cb1262b0f677
2026-10-05 03:59:21,823 - DEBUG - Requesting: http://10.0.0.177:8082/access-control-lists
2026-10-05 03:59:21,834 - INFO - Validated that ACLs for Security group ctest-test_sec_group-71175043 are present in API Server
2026-10-05 03:59:21,841 - INFO - Validated that Security group ctest-test_sec_group-71175043 is found in control node 10.0.0.177
2026-10-05 03:59:21,852 - DEBUG - Security group ctest-test_sec_group-71175043 ACLs found in the control node 10.0.0.177
2026-10-05 03:59:21,862 - INFO - Validated that Security group ctest-test_sec_group-71175043 is found in control node 10.0.0.38
2026-10-05 03:59:21,872 - DEBUG - Security group ctest-test_sec_group-71175043 ACLs found in the control node 10.0.0.38
2026-10-05 03:59:21,881 - INFO - Validated that Security group ctest-test_sec_group-71175043 is found in control node 10.0.0.190
2026-10-05 03:59:21,889 - DEBUG - Security group ctest-test_sec_group-71175043 ACLs found in the control node 10.0.0.190
2026-10-05 03:59:21,889 - INFO - Validated SG ctest-test_sec_group-71175043 in Control nodes
2026-10-05 03:59:21,889 - INFO - Deleting Security group: ['default-domain', 'ctest-SecurityGroupBasicRegressionTests1_contrail-34544971', 'ctest-test_sec_group-71175043']
2026-10-05 03:59:21,998 - INFO - Security group: ['default-domain', 'ctest-SecurityGroupBasicRegressionTests1_contrail-34544971', 'ctest-test_sec_group-71175043'] deleted successfully.
2026-10-05 03:59:21,998 - DEBUG - Requesting: http://10.0.0.177:8082/domains
2026-10-05 03:59:22,008 - DEBUG - Requesting: http://10.0.0.177:8082/domain/6850e378-7089-4036-8f54-55c0ed1b9054
2026-10-05 03:59:22,031 - DEBUG - Requesting: http://10.0.0.177:8082/project/cf2b70b2-743c-4124-b4b7-cb1262b0f677
2026-10-05 03:59:22,147 - INFO - Security group ctest-test_sec_group-71175043 removed from the API Server
2026-10-05 03:59:22,148 - DEBUG - Requesting: http://10.0.0.177:8082/domains
2026-10-05 03:59:22,158 - DEBUG - Requesting: http://10.0.0.177:8082/domain/6850e378-7089-4036-8f54-55c0ed1b9054
2026-10-05 03:59:22,177 - DEBUG - Requesting: http://10.0.0.177:8082/project/cf2b70b2-743c-4124-b4b7-cb1262b0f677
2026-10-05 03:59:22,291 - DEBUG - Requesting: http://10.0.0.177:8082/access-control-lists
2026-10-05 03:59:22,302 - DEBUG - ACLs for Security group ctest-test_sec_group-71175043 removed from the API Server
2026-10-05 03:59:22,309 - INFO - security group ctest-test_sec_group-71175043 removed from Control-node 10.0.0.177
2026-10-05 03:59:22,315 - DEBUG - Security group ctest-test_sec_group-71175043 ACLs removed from the control node 10.0.0.177
2026-10-05 03:59:22,321 - INFO - security group ctest-test_sec_group-71175043 removed from Control-node 10.0.0.38
2026-10-05 03:59:22,329 - DEBUG - Security group ctest-test_sec_group-71175043 ACLs removed from the control node 10.0.0.38
2026-10-05 03:59:22,335 - INFO - security group ctest-test_sec_group-71175043 removed from Control-node 10.0.0.190
2026-10-05 03:59:22,342 - DEBUG - Security group ctest-test_sec_group-71175043 ACLs removed from the control node 10.0.0.190
2026-10-05 03:59:22,342 - INFO - Validated that SG ctest-test_sec_group-71175043 is not in control nodes
2026-10-05 03:59:22,350 - INFO - Creating Security group: ['default-domain', 'ctest-SecurityGroupBasicRegressionTests1_contrail-34544971', 'ctest-test_sec_group-71175043']
2026-10-05 03:59:22,562 - DEBUG - Security group: ['default-domain', 'ctest-SecurityGroupBasicRegressionTests1_contrail-34544971', 'ctest-test_sec_group-71175043'] created succesfully
2026-10-05 03:59:22,562 - DEBUG - Requesting: http://10.0.0.177:8082/domains
2026-10-05 03:59:22,571 - DEBUG - Requesting: http://10.0.0.177:8082/domain/6850e378-7089-4036-8f54-55c0ed1b9054
2026-10-05 03:59:22,585 - DEBUG - Requesting: http://10.0.0.177:8082/project/cf2b70b2-743c-4124-b4b7-cb1262b0f677
2026-10-05 03:59:22,698 - DEBUG - Requesting: http://10.0.0.177:8082/security-group/3cf674e0-7e4c-4e54-b198-299e8b8c6b50
2026-10-05 03:59:22,713 - INFO - Security group ctest-test_sec_group-71175043 found in the API Server
2026-10-05 03:59:22,713 - DEBUG - Requesting: http://10.0.0.177:8082/domains
2026-10-05 03:59:22,724 - DEBUG - Requesting: http://10.0.0.177:8082/domain/6850e378-7089-4036-8f54-55c0ed1b9054
2026-10-05 03:59:22,739 - DEBUG - Requesting: http://10.0.0.177:8082/project/cf2b70b2-743c-4124-b4b7-cb1262b0f677
2026-10-05 03:59:22,852 - DEBUG - Requesting: http://10.0.0.177:8082/access-control-lists
2026-10-05 03:59:22,864 - INFO - Validated that ACLs for Security group ctest-test_sec_group-71175043 are present in API Server
2026-10-05 03:59:22,871 - INFO - Validated that Security group ctest-test_sec_group-71175043 is found in control node 10.0.0.177
2026-10-05 03:59:22,878 - DEBUG - Security group ctest-test_sec_group-71175043 ACLs found in the control node 10.0.0.177
2026-10-05 03:59:22,885 - INFO - Validated that Security group ctest-test_sec_group-71175043 is found in control node 10.0.0.38
2026-10-05 03:59:22,894 - DEBUG - Security group ctest-test_sec_group-71175043 ACLs found in the control node 10.0.0.38
2026-10-05 03:59:22,901 - INFO - Validated that Security group ctest-test_sec_group-71175043 is found in control node 10.0.0.190
2026-10-05 03:59:22,908 - DEBUG - Security group ctest-test_sec_group-71175043 ACLs found in the control node 10.0.0.190
2026-10-05 03:59:22,908 - INFO - Validated SG ctest-test_sec_group-71175043 in Control nodes
2026-10-05 03:59:22,909 - DEBUG - Replace all the rules of this security group ctest-test_sec_group-71175043 with the new rules
2026-10-05 03:59:22,909 - DEBUG - [{'protocol': 'tcp', 'dst_addresses': [{'subnet': {'ip_prefix': '40.159.157.192', 'ip_prefix_len': '26'}}], 'dst_ports': [{'start_port': 0, 'end_port': -1}], 'src_ports': [{'start_port': 0, 'end_port': -1}], 'src_addresses': [{'security_group': 'local'}]}, {'protocol': 'tcp', 'src_addresses': [{'subnet': {'ip_prefix': '40.159.157.192', 'ip_prefix_len': '26'}}], 'dst_ports': [{'start_port': 0, 'end_port': -1}], 'src_ports': [{'start_port': 0, 'end_port': -1}], 'dst_addresses': [{'security_group': 'local'}]}]
2026-10-05 03:59:23,452 - DEBUG - Response for create_network : {'network': {'id': '4dafaf3a-9abe-4d3a-b07d-e68b79b6bf1d', 'name': 'ctest-SecurityGroupBasicRegressionTests1_contrail-34544971-86249023', 'tenant_id': 'cf2b70b2743c4124b4b7cb1262b0f677', 'project_id': 'cf2b70b2743c4124b4b7cb1262b0f677', 'admin_state_up': True, 'shared': False, 'status': 'ACTIVE', 'router:external': False, 'mtu': 0, 'tags': [], 'subnets': [], 'fq_name': ['default-domain', 'ctest-SecurityGroupBasicRegressionTests1_contrail-34544971', 'ctest-SecurityGroupBasicRegressionTests1_contrail-34544971-86249023'], 'port_security_enabled': True, 'description': ''}}
2026-10-05 03:59:23,773 - DEBUG - Response for create_subnet : {'subnet': {'id': '9370c27a-d955-44bc-ac43-f5d12fa21e2d', 'name': '', 'tenant_id': 'cf2b70b2743c4124b4b7cb1262b0f677', 'network_id': '4dafaf3a-9abe-4d3a-b07d-e68b79b6bf1d', 'ip_version': 4, 'cidr': '40.159.157.192/26', 'allocation_pools': [{'start': '40.159.157.194', 'end': '40.159.157.254'}], 'gateway_ip': '40.159.157.193', 'enable_dhcp': True, 'ipv6_ra_mode': None, 'ipv6_address_mode': None, 'dns_nameservers': [], 'host_routes': [], 'dns_server_address': '40.159.157.194', 'tags': [], 'project_id': 'cf2b70b2743c4124b4b7cb1262b0f677'}}
2026-10-05 03:59:23,799 - INFO - Created VN ctest-SecurityGroupBasicRegressionTests1_contrail-34544971-86249023
2026-10-05 03:59:23,821 - DEBUG - VN ctest-SecurityGroupBasicRegressionTests1_contrail-34544971-86249023 UUID is 4dafaf3a-9abe-4d3a-b07d-e68b79b6bf1d
2026-10-05 03:59:23,899 - DEBUG - Requesting: http://10.0.0.177:8082/domains
2026-10-05 03:59:23,907 - DEBUG - Requesting: http://10.0.0.177:8082/domain/6850e378-7089-4036-8f54-55c0ed1b9054
2026-10-05 03:59:23,921 - DEBUG - Requesting: http://10.0.0.177:8082/project/cf2b70b2-743c-4124-b4b7-cb1262b0f677
2026-10-05 03:59:24,040 - DEBUG - Requesting: http://10.0.0.177:8082/virtual-network/4dafaf3a-9abe-4d3a-b07d-e68b79b6bf1d
2026-10-05 03:59:24,057 - DEBUG - Requesting: http://10.0.0.177:8082/virtual-network/4dafaf3a-9abe-4d3a-b07d-e68b79b6bf1d
2026-10-05 03:59:24,073 - DEBUG - Requesting: http://10.0.0.177:8082/routing-instance/94919fd2-b726-480c-8a37-916ce24ca4f9
2026-10-05 03:59:24,085 - DEBUG - Requesting: http://10.0.0.177:8082/routing-instance/94919fd2-b726-480c-8a37-916ce24ca4f9
2026-10-05 03:59:24,097 - DEBUG - Requesting: http://10.0.0.177:8082/route-target/f087a8b9-1364-4244-8bb7-868b6bfc7814
2026-10-05 03:59:24,111 - DEBUG - Route Targets: ['target:64512:8000010']
2026-10-05 03:59:24,111 - DEBUG - Requesting: http://10.0.0.177:8082/virtual-network/4dafaf3a-9abe-4d3a-b07d-e68b79b6bf1d
2026-10-05 03:59:24,133 - DEBUG - Requesting: http://10.0.0.177:8082/routing-instance/94919fd2-b726-480c-8a37-916ce24ca4f9
2026-10-05 03:59:24,156 - INFO - Verified VN network id 19 for VN 4dafaf3a-9abe-4d3a-b07d-e68b79b6bf1d
2026-10-05 03:59:24,156 - INFO - Verifications in API Server for VN ctest-SecurityGroupBasicRegressionTests1_contrail-34544971-86249023 passed
2026-10-05 03:59:24,156 - DEBUG - Requesting: http://10.0.0.177:8082/virtual-network/4dafaf3a-9abe-4d3a-b07d-e68b79b6bf1d
2026-10-05 03:59:24,169 - DEBUG - Requesting: http://10.0.0.177:8082/routing-instance/94919fd2-b726-480c-8a37-916ce24ca4f9
2026-10-05 03:59:24,181 - DEBUG - Requesting: http://10.0.0.177:8082/routing-instance/94919fd2-b726-480c-8a37-916ce24ca4f9
2026-10-05 03:59:24,192 - DEBUG - Requesting: http://10.0.0.177:8082/route-target/f087a8b9-1364-4244-8bb7-868b6bfc7814
2026-10-05 03:59:24,209 - DEBUG - Control-node 10.0.0.177 : VN object is : {'node_name': 'virtual-network:default-domain:ctest-SecurityGroupBasicRegressionTests1_contrail-34544971:ctest-SecurityGroupBasicRegressionTests1_contrail-34544971-86249023', 'interests': '-', 'advertised': '-', 'dbentryflags': None, 'obj_info': {'sequence_number': '0', 'origin': 'Cassandra', 'data': {'id-perms': {'permissions': {'owner': 'ctest-SecurityGroupBasicRegressionTests1_contrail-34544971', 'owner-access': '7', 'group': 'reader', 'group-access': '7', 'other-access': '7'}, 'uuid': {'uuid-mslong': '5597885528083942714', 'uuid-lslong': '12717574409481010973'}, 'enable': 'true', 'created': '2026-10-05T03:59:23', 'last-modified': '2026-10-05T03:59:23', 'description': None, 'user-visible': 'true', 'creator': None}}}, 'neighbors': None, 'last_modified': '00:00:00.501956'}
2026-10-05 03:59:24,218 - DEBUG - Route Targets: ['target:64512:8000010']
2026-10-05 03:59:24,234 - DEBUG - Control-node 10.0.0.38 : VN object is : {'node_name': 'virtual-network:default-domain:ctest-SecurityGroupBasicRegressionTests1_contrail-34544971:ctest-SecurityGroupBasicRegressionTests1_contrail-34544971-86249023', 'interests': '-', 'advertised': '-', 'dbentryflags': None, 'obj_info': {'sequence_number': '0', 'origin': 'Cassandra', 'data': {'id-perms': {'permissions': {'owner': 'ctest-SecurityGroupBasicRegressionTests1_contrail-34544971', 'owner-access': '7', 'group': 'reader', 'group-access': '7', 'other-access': '7'}, 'uuid': {'uuid-mslong': '5597885528083942714', 'uuid-lslong': '12717574409481010973'}, 'enable': 'true', 'created': '2026-10-05T03:59:23', 'last-modified': '2026-10-05T03:59:23', 'description': None, 'user-visible': 'true', 'creator': None}}}, 'neighbors': None, 'last_modified': '00:00:00.522493'}
2026-10-05 03:59:24,279 - DEBUG - Route Targets: ['target:64512:8000010']
2026-10-05 03:59:24,286 - DEBUG - Control-node 10.0.0.190 : VN object is : {'node_name': 'virtual-network:default-domain:ctest-SecurityGroupBasicRegressionTests1_contrail-34544971:ctest-SecurityGroupBasicRegressionTests1_contrail-34544971-86249023', 'interests': '-', 'advertised': '-', 'dbentryflags': None, 'obj_info': {'sequence_number': '0', 'origin': 'Cassandra', 'data': {'id-perms': {'permissions': {'owner': 'ctest-SecurityGroupBasicRegressionTests1_contrail-34544971', 'owner-access': '7', 'group': 'reader', 'group-access': '7', 'other-access': '7'}, 'uuid': {'uuid-mslong': '5597885528083942714', 'uuid-lslong': '12717574409481010973'}, 'enable': 'true', 'created': '2026-10-05T03:59:23', 'last-modified': '2026-10-05T03:59:23', 'description': None, 'user-visible': 'true', 'creator': None}}}, 'neighbors': None, 'last_modified': '00:00:00.580470'}
2026-10-05 03:59:24,294 - DEBUG - Route Targets: ['target:64512:8000010']
2026-10-05 03:59:24,294 - INFO - On all control nodes, Config, RI and RT verification for VN ctest-SecurityGroupBasicRegressionTests1_contrail-34544971-86249023 passed
2026-10-05 03:59:24,294 - DEBUG - ====Verifying policy data for ctest-SecurityGroupBasicRegressionTests1_contrail-34544971-86249023 in API_Server ======
2026-10-05 03:59:24,294 - DEBUG - Requesting: http://10.0.0.177:8082/domains
2026-10-05 03:59:24,301 - DEBUG - Requesting: http://10.0.0.177:8082/domain/6850e378-7089-4036-8f54-55c0ed1b9054
2026-10-05 03:59:24,316 - DEBUG - Requesting: http://10.0.0.177:8082/project/cf2b70b2-743c-4124-b4b7-cb1262b0f677
2026-10-05 03:59:24,451 - DEBUG - Requesting: http://10.0.0.177:8082/virtual-network/4dafaf3a-9abe-4d3a-b07d-e68b79b6bf1d
2026-10-05 03:59:24,465 - DEBUG - =>VN ctest-SecurityGroupBasicRegressionTests1_contrail-34544971-86249023 has no policy to be verified
2026-10-05 03:59:24,465 - DEBUG - Verifying the vn in opserver
2026-10-05 03:59:24,465 - DEBUG - Verifying the default-domain:ctest-SecurityGroupBasicRegressionTests1_contrail-34544971:ctest-SecurityGroupBasicRegressionTests1_contrail-34544971-86249023 virtual network link through opserver 10.0.0.177
2026-10-05 03:59:24,466 - DEBUG - Requesting: http://10.0.0.177:8081/analytics/uves/virtual-networks
2026-10-05 03:59:24,867 - DEBUG - Requesting: http://10.0.0.177:8081/analytics/uves/virtual-networks
2026-10-05 03:59:24,952 - DEBUG - vn link and name as {'name': 'default-domain:ctest-SecurityGroupBasicRegressionTests1_contrail-34544971:ctest-SecurityGroupBasicRegressionTests1_contrail-34544971-86249023', 'href': 'http://10.0.0.177:8081/analytics/uves/virtual-network/default-domain:ctest-SecurityGroupBasicRegressionTests1_contrail-34544971:ctest-SecurityGroupBasicRegressionTests1_contrail-34544971-86249023?flat'}
2026-10-05 03:59:24,952 - DEBUG - Verifying the default-domain:ctest-SecurityGroupBasicRegressionTests1_contrail-34544971:ctest-SecurityGroupBasicRegressionTests1_contrail-34544971-86249023 virtual network link through opserver 10.0.0.38
2026-10-05 03:59:24,952 - DEBUG - Requesting: http://10.0.0.38:8081/analytics/uves/virtual-networks
2026-10-05 03:59:25,362 - DEBUG - Requesting: http://10.0.0.38:8081/analytics/uves/virtual-networks
2026-10-05 03:59:25,432 - DEBUG - vn link and name as {'name': 'default-domain:ctest-SecurityGroupBasicRegressionTests1_contrail-34544971:ctest-SecurityGroupBasicRegressionTests1_contrail-34544971-86249023', 'href': 'http://10.0.0.38:8081/analytics/uves/virtual-network/default-domain:ctest-SecurityGroupBasicRegressionTests1_contrail-34544971:ctest-SecurityGroupBasicRegressionTests1_contrail-34544971-86249023?flat'}
2026-10-05 03:59:25,432 - DEBUG - Verifying the default-domain:ctest-SecurityGroupBasicRegressionTests1_contrail-34544971:ctest-SecurityGroupBasicRegressionTests1_contrail-34544971-86249023 virtual network link through opserver 10.0.0.190
2026-10-05 03:59:25,432 - DEBUG - Requesting: http://10.0.0.190:8081/analytics/uves/virtual-networks
2026-10-05 03:59:25,844 - DEBUG - Requesting: http://10.0.0.190:8081/analytics/uves/virtual-networks
2026-10-05 03:59:25,912 - DEBUG - vn link and name as {'name': 'default-domain:ctest-SecurityGroupBasicRegressionTests1_contrail-34544971:ctest-SecurityGroupBasicRegressionTests1_contrail-34544971-86249023', 'href': 'http://10.0.0.190:8081/analytics/uves/virtual-network/default-domain:ctest-SecurityGroupBasicRegressionTests1_contrail-34544971:ctest-SecurityGroupBasicRegressionTests1_contrail-34544971-86249023?flat'}
2026-10-05 03:59:25,913 - INFO - Validated that VN default-domain:ctest-SecurityGroupBasicRegressionTests1_contrail-34544971:ctest-SecurityGroupBasicRegressionTests1_contrail-34544971-86249023 is found in opserver
2026-10-05 03:59:25,946 - DEBUG - Do not have enough data to verify VN in agent
2026-10-05 03:59:25,964 - DEBUG - VRF ids for VN ctest-SecurityGroupBasicRegressionTests1_contrail-34544971-86249023: {}
2026-10-05 03:59:26,176 - DEBUG - Services list from nova: [, , , ]
2026-10-05 03:59:26,883 - INFO - VM ([]) created on node: (an-jenkins-deploy-platform-ansible-os-6343-1), Zone: (nova:an-jenkins-deploy-platform-ansible-os-6343-1)
2026-10-05 03:59:27,712 - INFO - VM ([]) created on node: (an-jenkins-deploy-platform-ansible-os-6343-2), Zone: (nova:an-jenkins-deploy-platform-ansible-os-6343-2)
2026-10-05 03:59:27,794 - DEBUG - VM is still in BUILD state, Expected: ACTIVE
2026-10-05 03:59:32,906 - DEBUG - VM is still in BUILD state, Expected: ACTIVE
2026-10-05 03:59:38,002 - DEBUG - VM is still in BUILD state, Expected: ACTIVE
2026-10-05 03:59:43,094 - DEBUG - VM is still in BUILD state, Expected: ACTIVE
2026-10-05 03:59:48,196 - DEBUG - VM is still in BUILD state, Expected: ACTIVE
2026-10-05 03:59:53,292 - DEBUG - VM is in ACTIVE state now
2026-10-05 03:59:53,292 - INFO - VM name : ctest-SecurityGroupBasicRegressionTests1_contrail-34544971-41539227
2026-10-05 03:59:53,398 - DEBUG - VM ctest-SecurityGroupBasicRegressionTests1_contrail-34544971-41539227 ID is 1c336f8a-3360-43a7-a7c8-326c7c9f1ccd
2026-10-05 03:59:53,496 - DEBUG - VM is in ACTIVE state now
2026-10-05 03:59:53,526 - DEBUG - VM ctest-SecurityGroupBasicRegressionTests1_contrail-34544971-41539227 launched on Node an-jenkins-deploy-platform-ansible-os-6343-1
2026-10-05 03:59:53,621 - DEBUG - Requesting: http://10.0.0.190:8082/virtual-machine/1c336f8a-3360-43a7-a7c8-326c7c9f1ccd
2026-10-05 03:59:53,998 - DEBUG - Requesting: http://10.0.0.190:8082/virtual-machine/1c336f8a-3360-43a7-a7c8-326c7c9f1ccd
2026-10-05 03:59:54,035 - DEBUG - Requesting: http://10.0.0.190:8082/virtual-machine/1c336f8a-3360-43a7-a7c8-326c7c9f1ccd
2026-10-05 03:59:54,045 - DEBUG - Requesting: http://10.0.0.190:8082/virtual-machine-interface/6d60159a-7e5f-4bbd-84e4-5f0c2f6473cf
2026-10-05 03:59:54,057 - DEBUG - Requesting: http://10.0.0.190:8082/virtual-machine/1c336f8a-3360-43a7-a7c8-326c7c9f1ccd
2026-10-05 03:59:54,068 - DEBUG - Requesting: http://10.0.0.190:8082/virtual-machine-interface/6d60159a-7e5f-4bbd-84e4-5f0c2f6473cf
2026-10-05 03:59:54,080 - DEBUG - Requesting: http://10.0.0.190:8082/instance-ip/184eee21-c814-4049-baba-f6972849e73d
2026-10-05 03:59:54,094 - DEBUG - Verifying in api server 10.0.0.190
2026-10-05 03:59:54,094 - DEBUG - Requesting: http://10.0.0.190:8082/virtual-machine/1c336f8a-3360-43a7-a7c8-326c7c9f1ccd
2026-10-05 03:59:54,104 - DEBUG - Requesting: http://10.0.0.190:8082/virtual-machine-interface/6d60159a-7e5f-4bbd-84e4-5f0c2f6473cf
2026-10-05 03:59:54,117 - DEBUG - Requesting: http://10.0.0.190:8082/instance-ip/184eee21-c814-4049-baba-f6972849e73d
2026-10-05 03:59:54,127 - INFO - VM ctest-SecurityGroupBasicRegressionTests1_contrail-34544971-41539227 verfication in all API Servers passed
2026-10-05 03:59:54,151 - DEBUG - VM ctest-SecurityGroupBasicRegressionTests1_contrail-34544971-41539227 Tap interface: {'index': '3', 'name': 'tap6d60159a-7e', 'uuid': '6d60159a-7e5f-4bbd-84e4-5f0c2f6473cf', 'vrf_name': 'default-domain:ctest-SecurityGroupBasicRegressionTests1_contrail-34544971:ctest-SecurityGroupBasicRegressionTests1_contrail-34544971-86249023:ctest-SecurityGroupBasicRegressionTests1_contrail-34544971-86249023', 'active': 'Active', 'ipv4_active': 'Active', 'l2_active': 'L2 Active', 'ip6_active': 'Ipv6 Inactive < no-ipv6-addr >', 'health_check_active': 'Active', 'dhcp_service': 'Enable', 'dhcp_service_v6': 'Disable', 'dns_service': 'Enable', 'type': 'vport', 'label': '25', 'l2_label': '29', 'vxlan_id': '19', 'vn_name': 'default-domain:ctest-SecurityGroupBasicRegressionTests1_contrail-34544971:ctest-SecurityGroupBasicRegressionTests1_contrail-34544971-86249023', 'vm_uuid': '1c336f8a-3360-43a7-a7c8-326c7c9f1ccd', 'vm_name': 'ctest-SecurityGroupBasicRegressionTests1_contrail-34544971-41539227', 'ip_addr': '40.159.157.195', 'mac_addr': '02:6d:60:15:9a:7e', 'policy': 'Enable', 'fip_list': [], 'mdata_ip_addr': '169.254.0.3', 'service_vlan_list': None, 'os_ifindex': '60', 'fabric_port': 'NotFabricPort', 'alloc_linklocal_ip': 'LL-Enable', 'analyzer_name': None, 'config_name': 'default-domain:ctest-SecurityGroupBasicRegressionTests1_contrail-34544971:6d60159a-7e5f-4bbd-84e4-5f0c2f6473cf', 'sg_uuid_list': ['3cf674e0-7e4c-4e54-b198-299e8b8c6b50'], 'static_route_list': None, 'vm_project_uuid': 'cf2b70b2-743c-4124-b4b7-cb1262b0f677', 'admin_state': 'Enabled', 'flow_key_idx': '31', 'allowed_address_pair_list': None, 'ip6_addr': '::', 'local_preference': '0', 'tx_vlan_id': '-1', 'rx_vlan_id': '-1', 'parent_interface': None, 'subnet': '--NA--', 'sub_type': 'Tap', 'vrf_assign_acl_uuid': '--NA--', 'vmi_type': 'Virtual Machine', 'transport': 'Ethernet', 'logical_interface_uuid': '00000000-0000-0000-0000-000000000000', 'flood_unknown_unicast': 'false', 'physical_device': None, 'physical_interface': None, 'fixed_ip4_list': None, 'fixed_ip6_list': None, 'fat_flow_list': None, 'metadata_ip_active': 'Active', 'service_health_check_ip': '0.0.0.0', 'alias_ip_list': None, 'drop_new_flows': 'false', 'bridge_domain_list': [], 'vmi_tag_list': None, 'policy_set_acl_list': None, 'slo_list': None, 'vhostuser_mode': '0', 'si_other_end_vmi': '00000000-0000-0000-0000-000000000000', 'cfg_igmp_enable': 'false', 'igmp_enabled': 'false', 'max_flows': '0', 'policy_set_fwaas_list': None, 'bond_interface_list': None, 'mac_ip_learning_enable': 'false', 'mac_ip_list': []}
2026-10-05 03:59:54,151 - DEBUG - Agent 10.0.0.50 vrf name: default-domain:ctest-SecurityGroupBasicRegressionTests1_contrail-34544971:ctest-SecurityGroupBasicRegressionTests1_contrail-34544971-86249023:ctest-SecurityGroupBasicRegressionTests1_contrail-34544971-86249023
2026-10-05 03:59:54,159 - DEBUG - Agent VRF Object : {'vrf_list': [{'name': 'default-domain:ctest-SecurityGroupBasicRegressionTests1_contrail-34544971:ctest-SecurityGroupBasicRegressionTests1_contrail-34544971-86249023:ctest-SecurityGroupBasicRegressionTests1_contrail-34544971-86249023', 'ucindex': '2', 'mcindex': '2', 'l2index': '2', 'source': 'Config; ', 'uc6index': '2', 'vn': 'default-domain:ctest-SecurityGroupBasicRegressionTests1_contrail-34544971:ctest-SecurityGroupBasicRegressionTests1_contrail-34544971-86249023', 'table_label': '-1', 'vxlan_id': '19', 'evpnindex': '2', 'brindex': '2', 'mplsindex': '0', 'RD': '10.20.0.193:2', 'mac_aging_time': '0', 'layer2_control_word': 'false', 'forwarding_vrf': None, 'hbf_rintf': '-1', 'hbf_lintf': '-1'}]}
2026-10-05 03:59:54,256 - DEBUG - VM ctest-SecurityGroupBasicRegressionTests1_contrail-34544971-41539227 : Tap interface tap6d60159a-7e is set to Active
2026-10-05 03:59:54,256 - DEBUG - Tap interface tap6d60159a-7e detail : {'index': '3', 'name': 'tap6d60159a-7e', 'uuid': '6d60159a-7e5f-4bbd-84e4-5f0c2f6473cf', 'vrf_name': 'default-domain:ctest-SecurityGroupBasicRegressionTests1_contrail-34544971:ctest-SecurityGroupBasicRegressionTests1_contrail-34544971-86249023:ctest-SecurityGroupBasicRegressionTests1_contrail-34544971-86249023', 'active': 'Active', 'ipv4_active': 'Active', 'l2_active': 'L2 Active', 'ip6_active': 'Ipv6 Inactive < no-ipv6-addr >', 'health_check_active': 'Active', 'dhcp_service': 'Enable', 'dhcp_service_v6': 'Disable', 'dns_service': 'Enable', 'type': 'vport', 'label': '25', 'l2_label': '29', 'vxlan_id': '19', 'vn_name': 'default-domain:ctest-SecurityGroupBasicRegressionTests1_contrail-34544971:ctest-SecurityGroupBasicRegressionTests1_contrail-34544971-86249023', 'vm_uuid': '1c336f8a-3360-43a7-a7c8-326c7c9f1ccd', 'vm_name': 'ctest-SecurityGroupBasicRegressionTests1_contrail-34544971-41539227', 'ip_addr': '40.159.157.195', 'mac_addr': '02:6d:60:15:9a:7e', 'policy': 'Enable', 'fip_list': [], 'mdata_ip_addr': '169.254.0.3', 'service_vlan_list': None, 'os_ifindex': '60', 'fabric_port': 'NotFabricPort', 'alloc_linklocal_ip': 'LL-Enable', 'analyzer_name': None, 'config_name': 'default-domain:ctest-SecurityGroupBasicRegressionTests1_contrail-34544971:6d60159a-7e5f-4bbd-84e4-5f0c2f6473cf', 'sg_uuid_list': ['3cf674e0-7e4c-4e54-b198-299e8b8c6b50'], 'static_route_list': None, 'vm_project_uuid': 'cf2b70b2-743c-4124-b4b7-cb1262b0f677', 'admin_state': 'Enabled', 'flow_key_idx': '31', 'allowed_address_pair_list': None, 'ip6_addr': '::', 'local_preference': '0', 'tx_vlan_id': '-1', 'rx_vlan_id': '-1', 'parent_interface': None, 'subnet': '--NA--', 'sub_type': 'Tap', 'vrf_assign_acl_uuid': '--NA--', 'vmi_type': 'Virtual Machine', 'transport': 'Ethernet', 'logical_interface_uuid': '00000000-0000-0000-0000-000000000000', 'flood_unknown_unicast': 'false', 'physical_device': None, 'physical_interface': None, 'fixed_ip4_list': None, 'fixed_ip6_list': None, 'fat_flow_list': None, 'metadata_ip_active': 'Active', 'service_health_check_ip': '0.0.0.0', 'alias_ip_list': None, 'drop_new_flows': 'false', 'bridge_domain_list': [], 'vmi_tag_list': None, 'policy_set_acl_list': None, 'slo_list': None, 'vhostuser_mode': '0', 'si_other_end_vmi': '00000000-0000-0000-0000-000000000000', 'cfg_igmp_enable': 'false', 'igmp_enabled': 'false', 'max_flows': '0', 'policy_set_fwaas_list': None, 'bond_interface_list': None, 'mac_ip_learning_enable': 'false', 'mac_ip_list': []}
2026-10-05 03:59:54,377 - DEBUG - Starting Layer 2 verification in Agent
2026-10-05 03:59:54,389 - DEBUG - Layer 2 path is seen for VM MAC 02:6d:60:15:9a:7e in agent 10.0.0.50
2026-10-05 03:59:54,390 - DEBUG - Active layer 2 route in agent is present for VMI tap6d60159a-7e
2026-10-05 03:59:54,390 - DEBUG - L2 label(29) matches bw route table and interface table
2026-10-05 03:59:54,408 - DEBUG - VN default-domain:ctest-SecurityGroupBasicRegressionTests1_contrail-34544971:ctest-SecurityGroupBasicRegressionTests1_contrail-34544971-86249023 is found in Agent of node 10.0.0.50
2026-10-05 03:59:54,512 - DEBUG - VRF IDs of VN default-domain:ctest-SecurityGroupBasicRegressionTests1_contrail-34544971:ctest-SecurityGroupBasicRegressionTests1_contrail-34544971-86249023 is consistent in agent 10.0.0.50
2026-10-05 03:59:54,512 - DEBUG - Route for VM IP ['40.159.157.195'] is consistent in agent 10.0.0.50
2026-10-05 03:59:54,512 - DEBUG - VN default-domain:ctest-SecurityGroupBasicRegressionTests1_contrail-34544971:ctest-SecurityGroupBasicRegressionTests1_contrail-34544971-86249023 verification for VM ctest-SecurityGroupBasicRegressionTests1_contrail-34544971-41539227 in Agent 10.0.0.50 passed
2026-10-05 03:59:54,629 - DEBUG - Starting all layer 2 verification in agent 10.0.0.50
2026-10-05 03:59:54,655 - DEBUG - Route for VM MAC 02:6d:60:15:9a:7e is consistent in agent 10.0.0.50
2026-10-05 03:59:57,859 - DEBUG - (True, 'PING 169.254.0.3 (169.254.0.3) 56(84) bytes of data.\r\n\r\n--- 169.254.0.3 ping statistics ---\r\n2 packets transmitted, 0 received, 100% packet loss, time 1010ms')
2026-10-05 03:59:57,860 - DEBUG - Ping to Metadata IP 169.254.0.3 of VM ctest-SecurityGroupBasicRegressionTests1_contrail-34544971-41539227 failed!
2026-10-05 03:59:57,877 - DEBUG - Gateway for vn default-domain:ctest-SecurityGroupBasicRegressionTests1_contrail-34544971:ctest-SecurityGroupBasicRegressionTests1_contrail-34544971-86249023 is 40.159.157.193 and allocation pool is NOT set
2026-10-05 04:00:01,949 - DEBUG - (True, 'PING 169.254.0.3 (169.254.0.3) 56(84) bytes of data.\r\n\r\n--- 169.254.0.3 ping statistics ---\r\n2 packets transmitted, 0 received, 100% packet loss, time 1013ms')
2026-10-05 04:00:01,950 - DEBUG - Ping to Metadata IP 169.254.0.3 of VM ctest-SecurityGroupBasicRegressionTests1_contrail-34544971-41539227 failed!
2026-10-05 04:00:01,972 - DEBUG - Gateway for vn default-domain:ctest-SecurityGroupBasicRegressionTests1_contrail-34544971:ctest-SecurityGroupBasicRegressionTests1_contrail-34544971-86249023 is 40.159.157.193 and allocation pool is NOT set
2026-10-05 04:00:06,049 - DEBUG - (True, 'PING 169.254.0.3 (169.254.0.3) 56(84) bytes of data.\r\n\r\n--- 169.254.0.3 ping statistics ---\r\n2 packets transmitted, 0 received, 100% packet loss, time 1013ms')
2026-10-05 04:00:06,049 - DEBUG - Ping to Metadata IP 169.254.0.3 of VM ctest-SecurityGroupBasicRegressionTests1_contrail-34544971-41539227 failed!
2026-10-05 04:00:06,068 - DEBUG - Gateway for vn default-domain:ctest-SecurityGroupBasicRegressionTests1_contrail-34544971:ctest-SecurityGroupBasicRegressionTests1_contrail-34544971-86249023 is 40.159.157.193 and allocation pool is NOT set
2026-10-05 04:00:10,148 - DEBUG - (True, 'PING 169.254.0.3 (169.254.0.3) 56(84) bytes of data.\r\n\r\n--- 169.254.0.3 ping statistics ---\r\n2 packets transmitted, 0 received, 100% packet loss, time 1013ms')
2026-10-05 04:00:10,148 - DEBUG - Ping to Metadata IP 169.254.0.3 of VM ctest-SecurityGroupBasicRegressionTests1_contrail-34544971-41539227 failed!
2026-10-05 04:00:10,166 - DEBUG - Gateway for vn default-domain:ctest-SecurityGroupBasicRegressionTests1_contrail-34544971:ctest-SecurityGroupBasicRegressionTests1_contrail-34544971-86249023 is 40.159.157.193 and allocation pool is NOT set
2026-10-05 04:00:14,244 - DEBUG - (True, 'PING 169.254.0.3 (169.254.0.3) 56(84) bytes of data.\r\n\r\n--- 169.254.0.3 ping statistics ---\r\n2 packets transmitted, 0 received, 100% packet loss, time 1009ms')
2026-10-05 04:00:14,245 - DEBUG - Ping to Metadata IP 169.254.0.3 of VM ctest-SecurityGroupBasicRegressionTests1_contrail-34544971-41539227 failed!
2026-10-05 04:00:14,264 - DEBUG - Gateway for vn default-domain:ctest-SecurityGroupBasicRegressionTests1_contrail-34544971:ctest-SecurityGroupBasicRegressionTests1_contrail-34544971-86249023 is 40.159.157.193 and allocation pool is NOT set
2026-10-05 04:00:18,339 - DEBUG - (True, 'PING 169.254.0.3 (169.254.0.3) 56(84) bytes of data.\r\n\r\n--- 169.254.0.3 ping statistics ---\r\n2 packets transmitted, 0 received, 100% packet loss, time 1010ms')
2026-10-05 04:00:18,339 - DEBUG - Ping to Metadata IP 169.254.0.3 of VM ctest-SecurityGroupBasicRegressionTests1_contrail-34544971-41539227 failed!
2026-10-05 04:00:18,358 - DEBUG - Gateway for vn default-domain:ctest-SecurityGroupBasicRegressionTests1_contrail-34544971:ctest-SecurityGroupBasicRegressionTests1_contrail-34544971-86249023 is 40.159.157.193 and allocation pool is NOT set
2026-10-05 04:00:22,434 - DEBUG - (True, 'PING 169.254.0.3 (169.254.0.3) 56(84) bytes of data.\r\n\r\n--- 169.254.0.3 ping statistics ---\r\n2 packets transmitted, 0 received, 100% packet loss, time 1007ms')
2026-10-05 04:00:22,434 - DEBUG - Ping to Metadata IP 169.254.0.3 of VM ctest-SecurityGroupBasicRegressionTests1_contrail-34544971-41539227 failed!
2026-10-05 04:00:22,458 - DEBUG - Gateway for vn default-domain:ctest-SecurityGroupBasicRegressionTests1_contrail-34544971:ctest-SecurityGroupBasicRegressionTests1_contrail-34544971-86249023 is 40.159.157.193 and allocation pool is NOT set
2026-10-05 04:00:26,528 - DEBUG - (True, 'PING 169.254.0.3 (169.254.0.3) 56(84) bytes of data.\r\n64 bytes from 169.254.0.3: icmp_seq=2 ttl=63 time=8.71 ms\r\n\r\n--- 169.254.0.3 ping statistics ---\r\n2 packets transmitted, 1 received, 50% packet loss, time 1005ms\r\nrtt min/avg/max/mdev = 8.712/8.712/8.712/0.000 ms')
2026-10-05 04:00:26,528 - INFO - Ping to Metadata IP 169.254.0.3 of VM ctest-SecurityGroupBasicRegressionTests1_contrail-34544971-41539227 passed
2026-10-05 04:00:26,529 - INFO - VM ctest-SecurityGroupBasicRegressionTests1_contrail-34544971-41539227 verifications in Compute nodes passed
2026-10-05 04:00:26,807 - DEBUG - Validated VM route 40.159.157.195 in vrouter of 10.0.0.50
2026-10-05 04:00:26,813 - DEBUG - Remote Nh validation passed. Expected Tunnel, label: None, 0; Got None,0
2026-10-05 04:00:26,813 - INFO - Validated routes of VM ctest-SecurityGroupBasicRegressionTests1_contrail-34544971-41539227 in all vrouters
2026-10-05 04:00:27,311 - DEBUG - Starting all layer2 verification in 10.0.0.38 Control Node
2026-10-05 04:00:27,418 - DEBUG - Layer2 route found for VM MAC 02:6d:60:15:9a:7e in Control-node 10.0.0.38
2026-10-05 04:00:27,418 - DEBUG - L2 Label for VM ctest-SecurityGroupBasicRegressionTests1_contrail-34544971-41539227 same between Control-node 10.0.0.38 and Agent, Expected: 29, Seen: 29
2026-10-05 04:00:27,418 - DEBUG - Starting all layer2 verification in 10.0.0.190 Control Node
2026-10-05 04:00:27,555 - DEBUG - Layer2 route found for VM MAC 02:6d:60:15:9a:7e in Control-node 10.0.0.190
2026-10-05 04:00:27,556 - DEBUG - L2 Label for VM ctest-SecurityGroupBasicRegressionTests1_contrail-34544971-41539227 same between Control-node 10.0.0.190 and Agent, Expected: 29, Seen: 29
2026-10-05 04:00:27,556 - INFO - Verification in Control-nodes for VM ctest-SecurityGroupBasicRegressionTests1_contrail-34544971-41539227 passed
2026-10-05 04:00:27,556 - DEBUG - Verifying the vm in opserver
2026-10-05 04:00:27,556 - DEBUG - Verifying in collector 10.0.0.190 ...
2026-10-05 04:00:27,556 - DEBUG - Requesting: http://10.0.0.190:8081/analytics/uves/virtual-machine/1c336f8a-3360-43a7-a7c8-326c7c9f1ccd?flat
2026-10-05 04:00:27,639 - DEBUG - Requesting: http://10.0.0.177:8081/analytics/uves/virtual-machine-interface/default-domain:ctest-SecurityGroupBasicRegressionTests1_contrail-34544971:6d60159a-7e5f-4bbd-84e4-5f0c2f6473cf?flat
2026-10-05 04:00:27,722 - DEBUG - Requesting: http://10.0.0.177:8081/analytics/uves/virtual-machine-interface/default-domain:ctest-SecurityGroupBasicRegressionTests1_contrail-34544971:6d60159a-7e5f-4bbd-84e4-5f0c2f6473cf?flat
2026-10-05 04:00:27,758 - DEBUG - Requesting: http://10.0.0.190:8081/analytics/uves/virtual-machine/1c336f8a-3360-43a7-a7c8-326c7c9f1ccd?flat
2026-10-05 04:00:27,778 - DEBUG - Verifying vm in vn uve
2026-10-05 04:00:27,778 - DEBUG - Requesting: http://10.0.0.177:8081/analytics/uves/virtual-machine-interface/default-domain:ctest-SecurityGroupBasicRegressionTests1_contrail-34544971:6d60159a-7e5f-4bbd-84e4-5f0c2f6473cf?flat
2026-10-05 04:00:27,859 - DEBUG - VM uve shows interface as {'fixed_ip4_list': ['40.159.157.195'], 'ip6_address': '::', 'ip_address': '40.159.157.195', 'label': 25, 'mac_address': '02:6d:60:15:9a:7e', 'port_mirror_enabled': False, 'uuid': '6d60159a-7e5f-4bbd-84e4-5f0c2f6473cf', 'vhostuser_mode': 0, 'gateway': '40.159.157.193', 'ip6_active': False, 'l2_active': True, 'vm_name': 'ctest-SecurityGroupBasicRegressionTests1_contrail-34544971-41539227', 'tx_vlan': 65535, 'virtual_network': 'default-domain:ctest-SecurityGroupBasicRegressionTests1_contrail-34544971:ctest-SecurityGroupBasicRegressionTests1_contrail-34544971-86249023', 'ip4_active': True, '__T': 1791172811236170, 'vm_uuid': '1c336f8a-3360-43a7-a7c8-326c7c9f1ccd', 'admin_state': True, 'active': True, 'rx_vlan': 65535, 'is_health_check_active': True, 'vn_uuid': '4dafaf3a-9abe-4d3a-b07d-e68b79b6bf1d'}
2026-10-05 04:00:27,859 - DEBUG - VM uve shows ip address as ['40.159.157.195', '::']
2026-10-05 04:00:27,860 - DEBUG - VM uve shows virtual network as default-domain:ctest-SecurityGroupBasicRegressionTests1_contrail-34544971:ctest-SecurityGroupBasicRegressionTests1_contrail-34544971-86249023
2026-10-05 04:00:27,860 - INFO - Verifying through opserver in 10.0.0.177
2026-10-05 04:00:27,860 - DEBUG - Requesting: http://10.0.0.177:8081/analytics/uves/virtual-network/default-domain:ctest-SecurityGroupBasicRegressionTests1_contrail-34544971:ctest-SecurityGroupBasicRegressionTests1_contrail-34544971-86249023?flat
2026-10-05 04:00:27,893 - DEBUG - expected vm list 1c336f8a-3360-43a7-a7c8-326c7c9f1ccd
2026-10-05 04:00:27,893 - DEBUG - Extracted vm list ['1c336f8a-3360-43a7-a7c8-326c7c9f1ccd']
2026-10-05 04:00:27,893 - INFO - VM 1c336f8a-3360-43a7-a7c8-326c7c9f1ccd is present in default-domain:ctest-SecurityGroupBasicRegressionTests1_contrail-34544971:ctest-SecurityGroupBasicRegressionTests1_contrail-34544971-86249023
2026-10-05 04:00:27,893 - DEBUG - Verifying vm in vrouter uve
2026-10-05 04:00:27,893 - DEBUG - Getting info from collector 10.0.0.190..
2026-10-05 04:00:27,893 - DEBUG - Requesting: http://10.0.0.190:8081/analytics/uves/virtual-machine/1c336f8a-3360-43a7-a7c8-326c7c9f1ccd?flat
2026-10-05 04:00:27,972 - DEBUG - VM uve shows vrouter as ['an-jenkins-deploy-platform-ansible-os-6343-1']
2026-10-05 04:00:27,972 - DEBUG - Requesting: http://10.0.0.177:8081/analytics/uves/generator/an-jenkins-deploy-platform-ansible-os-6343-1:Compute:contrail-vrouter-agent:0?flat
2026-10-05 04:00:28,019 - DEBUG - Requesting: http://10.0.0.38:8081/analytics/uves/vrouter/an-jenkins-deploy-platform-ansible-os-6343-1?flat
2026-10-05 04:00:28,120 - DEBUG - VM 1c336f8a-3360-43a7-a7c8-326c7c9f1ccd is present in vrouter an-jenkins-deploy-platform-ansible-os-6343-1 uve
2026-10-05 04:00:28,120 - DEBUG - Validated that VM ctest-SecurityGroupBasicRegressionTests1_contrail-34544971-41539227 is in Vrouter an-jenkins-deploy-platform-ansible-os-6343-1 UVE
2026-10-05 04:00:28,120 - DEBUG - Verifying vm tap interface/vn in vrouter uve
2026-10-05 04:00:28,129 - DEBUG - Expected tap interface of VM uuid 1c336f8a-3360-43a7-a7c8-326c7c9f1ccd is default-domain:ctest-SecurityGroupBasicRegressionTests1_contrail-34544971:6d60159a-7e5f-4bbd-84e4-5f0c2f6473cf
2026-10-05 04:00:28,129 - DEBUG - Expected VN of VM uuid 1c336f8a-3360-43a7-a7c8-326c7c9f1ccd is default-domain:ctest-SecurityGroupBasicRegressionTests1_contrail-34544971:ctest-SecurityGroupBasicRegressionTests1_contrail-34544971-86249023
2026-10-05 04:00:28,129 - DEBUG - Requesting: http://10.0.0.177:8081/analytics/uves/generator/an-jenkins-deploy-platform-ansible-os-6343-1:Compute:contrail-vrouter-agent:0?flat
2026-10-05 04:00:28,171 - DEBUG - Requesting: http://10.0.0.38:8081/analytics/uves/vrouter/an-jenkins-deploy-platform-ansible-os-6343-1?flat
2026-10-05 04:00:28,262 - DEBUG - VM 1c336f8a-3360-43a7-a7c8-326c7c9f1ccd is present in vrouter an-jenkins-deploy-platform-ansible-os-6343-1 uve
2026-10-05 04:00:28,262 - INFO - tap interface default-domain:ctest-SecurityGroupBasicRegressionTests1_contrail-34544971:6d60159a-7e5f-4bbd-84e4-5f0c2f6473cf of vm 1c336f8a-3360-43a7-a7c8-326c7c9f1ccd is present in vrouter an-jenkins-deploy-platform-ansible-os-6343-1 uve
2026-10-05 04:00:28,262 - DEBUG - Connected network default-domain:ctest-SecurityGroupBasicRegressionTests1_contrail-34544971:ctest-SecurityGroupBasicRegressionTests1_contrail-34544971-86249023 of vm 1c336f8a-3360-43a7-a7c8-326c7c9f1ccd is present in vrouter an-jenkins-deploy-platform-ansible-os-6343-1 uve
2026-10-05 04:00:28,262 - DEBUG - Verifying the 1c336f8a-3360-43a7-a7c8-326c7c9f1ccd virtual network link through opserver 10.0.0.177
2026-10-05 04:00:28,262 - DEBUG - Requesting: http://10.0.0.177:8081/analytics/uves/virtual-machines
2026-10-05 04:00:28,279 - DEBUG - VM link and name as {'name': '1c336f8a-3360-43a7-a7c8-326c7c9f1ccd', 'href': 'http://10.0.0.177:8081/analytics/uves/virtual-machine/1c336f8a-3360-43a7-a7c8-326c7c9f1ccd?flat'}
2026-10-05 04:00:28,279 - DEBUG - Verifying the 1c336f8a-3360-43a7-a7c8-326c7c9f1ccd virtual network link through opserver 10.0.0.38
2026-10-05 04:00:28,279 - DEBUG - Requesting: http://10.0.0.38:8081/analytics/uves/virtual-machines
2026-10-05 04:00:28,293 - DEBUG - VM link and name as {'name': '1c336f8a-3360-43a7-a7c8-326c7c9f1ccd', 'href': 'http://10.0.0.38:8081/analytics/uves/virtual-machine/1c336f8a-3360-43a7-a7c8-326c7c9f1ccd?flat'}
2026-10-05 04:00:28,293 - DEBUG - Verifying the 1c336f8a-3360-43a7-a7c8-326c7c9f1ccd virtual network link through opserver 10.0.0.190
2026-10-05 04:00:28,293 - DEBUG - Requesting: http://10.0.0.190:8081/analytics/uves/virtual-machines
2026-10-05 04:00:28,311 - DEBUG - VM link and name as {'name': '1c336f8a-3360-43a7-a7c8-326c7c9f1ccd', 'href': 'http://10.0.0.190:8081/analytics/uves/virtual-machine/1c336f8a-3360-43a7-a7c8-326c7c9f1ccd?flat'}
2026-10-05 04:00:28,311 - INFO - VM ctest-SecurityGroupBasicRegressionTests1_contrail-34544971-41539227 validations in Opserver passed
2026-10-05 04:00:28,311 - INFO - Waiting for VM ctest-SecurityGroupBasicRegressionTests1_contrail-34544971-41539227 to be up..
2026-10-05 04:00:28,311 - DEBUG - verify_vm_launched is skipped since self.vm_launch_flag is set
2026-10-05 04:00:28,311 - DEBUG - Requesting: http://10.0.0.190:8082/virtual-machine/1c336f8a-3360-43a7-a7c8-326c7c9f1ccd
2026-10-05 04:00:28,320 - DEBUG - Requesting: http://10.0.0.190:8082/virtual-machine-interface/6d60159a-7e5f-4bbd-84e4-5f0c2f6473cf
2026-10-05 04:00:29,498 - DEBUG - (True, 'PING 169.254.0.3 (169.254.0.3) 56(84) bytes of data.\r\n64 bytes from 169.254.0.3: icmp_seq=1 ttl=63 time=2.45 ms\r\n64 bytes from 169.254.0.3: icmp_seq=2 ttl=63 time=1.31 ms\r\n\r\n--- 169.254.0.3 ping statistics ---\r\n2 packets transmitted, 2 received, 0% packet loss, time 1001ms\r\nrtt min/avg/max/mdev = 1.314/1.884/2.454/0.570 ms')
2026-10-05 04:00:29,498 - INFO - Ping to Metadata IP 169.254.0.3 of VM ctest-SecurityGroupBasicRegressionTests1_contrail-34544971-41539227 passed
2026-10-05 04:00:29,577 - DEBUG - verify_vm_launched is skipped since self.vm_launch_flag is set
2026-10-05 04:00:29,577 - DEBUG - Waiting to SSH to VM ctest-SecurityGroupBasicRegressionTests1_contrail-34544971-41539227, IP 40.159.157.195, Port 22
2026-10-05 04:00:29,648 - DEBUG - Error on ssh to ubuntu@169.254.0.3:22, result: /bin/bash: connect: Connection refused
/bin/bash: line 1: /dev/tcp/169.254.0.3/22: Connection refused {'failed': True, 'command': '(echo > /dev/tcp/169.254.0.3/22)', 'real_command': '/bin/bash -l -c "(echo > /dev/tcp/169.254.0.3/22)"', 'return_code': 1, 'succeeded': False, 'stderr': ''}
2026-10-05 04:00:29,750 - DEBUG - VM ctest-SecurityGroupBasicRegressionTests1_contrail-34544971-41539227 is NOT ready for SSH connections, VM status: ACTIVE
2026-10-05 04:00:34,751 - DEBUG - verify_vm_launched is skipped since self.vm_launch_flag is set
2026-10-05 04:00:34,751 - DEBUG - Waiting to SSH to VM ctest-SecurityGroupBasicRegressionTests1_contrail-34544971-41539227, IP 40.159.157.195, Port 22
2026-10-05 04:00:34,820 - DEBUG - Error on ssh to ubuntu@169.254.0.3:22, result: /bin/bash: connect: Connection refused
/bin/bash: line 1: /dev/tcp/169.254.0.3/22: Connection refused {'failed': True, 'command': '(echo > /dev/tcp/169.254.0.3/22)', 'real_command': '/bin/bash -l -c "(echo > /dev/tcp/169.254.0.3/22)"', 'return_code': 1, 'succeeded': False, 'stderr': ''}
2026-10-05 04:00:34,921 - DEBUG - VM ctest-SecurityGroupBasicRegressionTests1_contrail-34544971-41539227 is NOT ready for SSH connections, VM status: ACTIVE
2026-10-05 04:00:39,922 - DEBUG - verify_vm_launched is skipped since self.vm_launch_flag is set
2026-10-05 04:00:39,922 - DEBUG - Waiting to SSH to VM ctest-SecurityGroupBasicRegressionTests1_contrail-34544971-41539227, IP 40.159.157.195, Port 22
2026-10-05 04:00:40,088 - DEBUG - VM ctest-SecurityGroupBasicRegressionTests1_contrail-34544971-41539227 is ready for SSH connections
2026-10-05 04:00:40,148 - DEBUG - VM is still in BUILD state, Expected: ACTIVE
2026-10-05 04:00:45,210 - DEBUG - VM is still in BUILD state, Expected: ACTIVE
2026-10-05 04:00:50,278 - DEBUG - VM is still in BUILD state, Expected: ACTIVE
2026-10-05 04:00:55,347 - DEBUG - VM is still in BUILD state, Expected: ACTIVE
2026-10-05 04:01:00,415 - DEBUG - VM is still in BUILD state, Expected: ACTIVE
2026-10-05 04:01:05,510 - DEBUG - VM is still in BUILD state, Expected: ACTIVE
2026-10-05 04:01:10,594 - DEBUG - VM is still in BUILD state, Expected: ACTIVE
2026-10-05 04:01:15,660 - DEBUG - VM is still in BUILD state, Expected: ACTIVE
2026-10-05 04:01:20,723 - DEBUG - VM is still in BUILD state, Expected: ACTIVE
2026-10-05 04:01:25,786 - DEBUG - VM is still in BUILD state, Expected: ACTIVE
2026-10-05 04:01:30,857 - DEBUG - VM is still in BUILD state, Expected: ACTIVE
2026-10-05 04:01:35,915 - DEBUG - VM is still in BUILD state, Expected: ACTIVE
2026-10-05 04:01:40,983 - DEBUG - VM is still in BUILD state, Expected: ACTIVE
2026-10-05 04:01:46,040 - DEBUG - VM is still in BUILD state, Expected: ACTIVE
2026-10-05 04:01:51,103 - DEBUG - VM is still in BUILD state, Expected: ACTIVE
2026-10-05 04:01:56,165 - DEBUG - VM is still in BUILD state, Expected: ACTIVE
2026-10-05 04:02:01,227 - DEBUG - VM is still in BUILD state, Expected: ACTIVE
2026-10-05 04:02:06,285 - DEBUG - VM is still in BUILD state, Expected: ACTIVE
2026-10-05 04:02:11,373 - DEBUG - VM is still in BUILD state, Expected: ACTIVE
2026-10-05 04:02:16,430 - DEBUG - VM is still in BUILD state, Expected: ACTIVE
2026-10-05 04:02:21,492 - DEBUG - VM is still in BUILD state, Expected: ACTIVE
2026-10-05 04:02:26,586 - DEBUG - VM is still in BUILD state, Expected: ACTIVE
2026-10-05 04:02:31,643 - DEBUG - VM is still in BUILD state, Expected: ACTIVE
2026-10-05 04:02:36,702 - DEBUG - VM is still in BUILD state, Expected: ACTIVE
2026-10-05 04:02:41,769 - DEBUG - VM is still in BUILD state, Expected: ACTIVE
2026-10-05 04:02:46,827 - DEBUG - VM is still in BUILD state, Expected: ACTIVE
2026-10-05 04:02:51,898 - DEBUG - VM is still in BUILD state, Expected: ACTIVE
2026-10-05 04:02:56,965 - DEBUG - VM is still in BUILD state, Expected: ACTIVE
2026-10-05 04:03:02,026 - DEBUG - VM is still in BUILD state, Expected: ACTIVE
2026-10-05 04:03:07,084 - DEBUG - VM is still in BUILD state, Expected: ACTIVE
2026-10-05 04:03:12,141 - DEBUG - VM is still in BUILD state, Expected: ACTIVE
2026-10-05 04:03:12,143 - INFO - Skip interface_detach for VM ctest-SecurityGroupBasicRegressionTests1_contrail-34544971-39589726 in state BUILD
2026-10-05 04:03:12,143 - INFO - Removing the security group from VM ctest-SecurityGroupBasicRegressionTests1_contrail-34544971-39589726
2026-10-05 04:03:12,214 - DEBUG - Security group 3cf674e0-7e4c-4e54-b198-299e8b8c6b50 not found for VM 5cffda62-6a2f-46a7-93a1-1fe1fe05ba5f, skip remove
2026-10-05 04:03:12,214 - INFO - Deleting VM ctest-SecurityGroupBasicRegressionTests1_contrail-34544971-39589726
2026-10-05 04:03:12,214 - ERROR - VM ctest-SecurityGroupBasicRegressionTests1_contrail-34544971-39589726 has failed to come up
2026-10-05 04:03:12,214 - ERROR - Nova failed to get host of the VM
2026-10-05 04:03:12,214 - ERROR - VM ctest-SecurityGroupBasicRegressionTests1_contrail-34544971-39589726 has failed to come up
2026-10-05 04:03:12,214 - ERROR - Nova failed to get host of the VM
2026-10-05 04:03:12,387 - INFO - Removing the security group from VM ctest-SecurityGroupBasicRegressionTests1_contrail-34544971-41539227
2026-10-05 04:03:12,644 - INFO - Deleting VM ctest-SecurityGroupBasicRegressionTests1_contrail-34544971-41539227
2026-10-05 04:03:12,729 - DEBUG - Verifying in api server 10.0.0.190
2026-10-05 04:03:12,729 - DEBUG - Requesting: http://10.0.0.190:8082/virtual-machine/1c336f8a-3360-43a7-a7c8-326c7c9f1ccd
2026-10-05 04:03:12,739 - DEBUG - VM ID 1c336f8a-3360-43a7-a7c8-326c7c9f1ccd of VM ctest-SecurityGroupBasicRegressionTests1_contrail-34544971-41539227 is still found in API Server
2026-10-05 04:03:14,740 - DEBUG - Verifying in api server 10.0.0.190
2026-10-05 04:03:14,740 - DEBUG - Requesting: http://10.0.0.190:8082/virtual-machine/1c336f8a-3360-43a7-a7c8-326c7c9f1ccd
2026-10-05 04:03:14,750 - DEBUG - VM ID 1c336f8a-3360-43a7-a7c8-326c7c9f1ccd of VM ctest-SecurityGroupBasicRegressionTests1_contrail-34544971-41539227 is still found in API Server
2026-10-05 04:03:16,752 - DEBUG - Verifying in api server 10.0.0.190
2026-10-05 04:03:16,752 - DEBUG - Requesting: http://10.0.0.190:8082/virtual-machine/1c336f8a-3360-43a7-a7c8-326c7c9f1ccd
2026-10-05 04:03:16,760 - DEBUG - Response Code: 404
2026-10-05 04:03:16,760 - DEBUG - Requesting: http://10.0.0.190:8082/virtual-machine/1c336f8a-3360-43a7-a7c8-326c7c9f1ccd
2026-10-05 04:03:16,768 - DEBUG - Response Code: 404
2026-10-05 04:03:16,769 - DEBUG - Requesting: http://10.0.0.190:8082/virtual-machine/1c336f8a-3360-43a7-a7c8-326c7c9f1ccd
2026-10-05 04:03:16,776 - DEBUG - Response Code: 404
2026-10-05 04:03:16,776 - INFO - VM ctest-SecurityGroupBasicRegressionTests1_contrail-34544971-41539227 is fully removed in API-Server
2026-10-05 04:03:16,948 - DEBUG - Skipping VM-deletion-check in nova db since mysql_token is not found
2026-10-05 04:03:16,996 - DEBUG - Validated that vrouter 10.0.0.50 does not have VMs route for VN default-domain:ctest-SecurityGroupBasicRegressionTests1_contrail-34544971:ctest-SecurityGroupBasicRegressionTests1_contrail-34544971-86249023
2026-10-05 04:03:17,010 - DEBUG - Validated that vrouter 10.0.0.191 does not have VMs route for VN default-domain:ctest-SecurityGroupBasicRegressionTests1_contrail-34544971:ctest-SecurityGroupBasicRegressionTests1_contrail-34544971-86249023
2026-10-05 04:03:17,010 - INFO - Validated that all vrouters do not have VMs route for VN default-domain:ctest-SecurityGroupBasicRegressionTests1_contrail-34544971:ctest-SecurityGroupBasicRegressionTests1_contrail-34544971-86249023
2026-10-05 04:03:17,010 - INFO - VM ctest-SecurityGroupBasicRegressionTests1_contrail-34544971-41539227 is removed in Compute, and routes are removed in all compute nodes
2026-10-05 04:03:17,223 - INFO - Routes for VM ctest-SecurityGroupBasicRegressionTests1_contrail-34544971-41539227 is removed in all control-nodes
2026-10-05 04:03:17,223 - DEBUG - Requesting: http://10.0.0.177:8081/analytics/uves/generator/an-jenkins-deploy-platform-ansible-os-6343-1:Compute:contrail-vrouter-agent:0?flat
2026-10-05 04:03:17,261 - DEBUG - Requesting: http://10.0.0.38:8081/analytics/uves/vrouter/an-jenkins-deploy-platform-ansible-os-6343-1?flat
2026-10-05 04:03:17,298 - DEBUG - VM 1c336f8a-3360-43a7-a7c8-326c7c9f1ccd is still present in vrouter an-jenkins-deploy-platform-ansible-os-6343-1 uve
2026-10-05 04:03:17,298 - DEBUG - Verifying if the vm interface deleted from vroter uve...
2026-10-05 04:03:17,298 - DEBUG - interface for vm 1c336f8a-3360-43a7-a7c8-326c7c9f1ccd deleted from vrouter uve ...
2026-10-05 04:03:17,298 - DEBUG - Deleted interface not in error interface list ...
2026-10-05 04:03:20,299 - DEBUG - Requesting: http://10.0.0.177:8081/analytics/uves/generator/an-jenkins-deploy-platform-ansible-os-6343-1:Compute:contrail-vrouter-agent:0?flat
2026-10-05 04:03:20,341 - DEBUG - Requesting: http://10.0.0.38:8081/analytics/uves/vrouter/an-jenkins-deploy-platform-ansible-os-6343-1?flat
2026-10-05 04:03:20,376 - DEBUG - VM 1c336f8a-3360-43a7-a7c8-326c7c9f1ccd is still present in vrouter an-jenkins-deploy-platform-ansible-os-6343-1 uve
2026-10-05 04:03:20,376 - DEBUG - Verifying if the vm interface deleted from vroter uve...
2026-10-05 04:03:20,376 - DEBUG - interface for vm 1c336f8a-3360-43a7-a7c8-326c7c9f1ccd deleted from vrouter uve ...
2026-10-05 04:03:20,376 - DEBUG - Deleted interface not in error interface list ...
2026-10-05 04:03:23,377 - DEBUG - Requesting: http://10.0.0.177:8081/analytics/uves/generator/an-jenkins-deploy-platform-ansible-os-6343-1:Compute:contrail-vrouter-agent:0?flat
2026-10-05 04:03:23,416 - DEBUG - Requesting: http://10.0.0.38:8081/analytics/uves/vrouter/an-jenkins-deploy-platform-ansible-os-6343-1?flat
2026-10-05 04:03:23,450 - DEBUG - VM 1c336f8a-3360-43a7-a7c8-326c7c9f1ccd is still present in vrouter an-jenkins-deploy-platform-ansible-os-6343-1 uve
2026-10-05 04:03:23,450 - DEBUG - Verifying if the vm interface deleted from vroter uve...
2026-10-05 04:03:23,450 - DEBUG - interface for vm 1c336f8a-3360-43a7-a7c8-326c7c9f1ccd deleted from vrouter uve ...
2026-10-05 04:03:23,450 - DEBUG - Deleted interface not in error interface list ...
2026-10-05 04:03:26,451 - DEBUG - Requesting: http://10.0.0.177:8081/analytics/uves/generator/an-jenkins-deploy-platform-ansible-os-6343-1:Compute:contrail-vrouter-agent:0?flat
2026-10-05 04:03:26,512 - DEBUG - Requesting: http://10.0.0.38:8081/analytics/uves/vrouter/an-jenkins-deploy-platform-ansible-os-6343-1?flat
2026-10-05 04:03:26,548 - DEBUG - VM 1c336f8a-3360-43a7-a7c8-326c7c9f1ccd is still present in vrouter an-jenkins-deploy-platform-ansible-os-6343-1 uve
2026-10-05 04:03:26,548 - DEBUG - Verifying if the vm interface deleted from vroter uve...
2026-10-05 04:03:26,548 - DEBUG - interface for vm 1c336f8a-3360-43a7-a7c8-326c7c9f1ccd deleted from vrouter uve ...
2026-10-05 04:03:26,548 - DEBUG - Deleted interface not in error interface list ...
2026-10-05 04:03:29,549 - DEBUG - Requesting: http://10.0.0.177:8081/analytics/uves/generator/an-jenkins-deploy-platform-ansible-os-6343-1:Compute:contrail-vrouter-agent:0?flat
2026-10-05 04:03:29,589 - DEBUG - Requesting: http://10.0.0.38:8081/analytics/uves/vrouter/an-jenkins-deploy-platform-ansible-os-6343-1?flat
2026-10-05 04:03:29,623 - DEBUG - VM 1c336f8a-3360-43a7-a7c8-326c7c9f1ccd is still present in vrouter an-jenkins-deploy-platform-ansible-os-6343-1 uve
2026-10-05 04:03:29,623 - DEBUG - Verifying if the vm interface deleted from vroter uve...
2026-10-05 04:03:29,623 - DEBUG - interface for vm 1c336f8a-3360-43a7-a7c8-326c7c9f1ccd deleted from vrouter uve ...
2026-10-05 04:03:29,623 - DEBUG - Deleted interface not in error interface list ...
2026-10-05 04:03:32,624 - DEBUG - Requesting: http://10.0.0.177:8081/analytics/uves/generator/an-jenkins-deploy-platform-ansible-os-6343-1:Compute:contrail-vrouter-agent:0?flat
2026-10-05 04:03:32,666 - DEBUG - Requesting: http://10.0.0.38:8081/analytics/uves/vrouter/an-jenkins-deploy-platform-ansible-os-6343-1?flat
2026-10-05 04:03:32,701 - DEBUG - VM 1c336f8a-3360-43a7-a7c8-326c7c9f1ccd is still present in vrouter an-jenkins-deploy-platform-ansible-os-6343-1 uve
2026-10-05 04:03:32,702 - DEBUG - Verifying if the vm interface deleted from vroter uve...
2026-10-05 04:03:32,702 - DEBUG - interface for vm 1c336f8a-3360-43a7-a7c8-326c7c9f1ccd deleted from vrouter uve ...
2026-10-05 04:03:32,702 - DEBUG - Deleted interface not in error interface list ...
2026-10-05 04:03:35,702 - DEBUG - Requesting: http://10.0.0.177:8081/analytics/uves/generator/an-jenkins-deploy-platform-ansible-os-6343-1:Compute:contrail-vrouter-agent:0?flat
2026-10-05 04:03:35,745 - DEBUG - Requesting: http://10.0.0.38:8081/analytics/uves/vrouter/an-jenkins-deploy-platform-ansible-os-6343-1?flat
2026-10-05 04:03:35,780 - DEBUG - VM 1c336f8a-3360-43a7-a7c8-326c7c9f1ccd is still present in vrouter an-jenkins-deploy-platform-ansible-os-6343-1 uve
2026-10-05 04:03:35,780 - DEBUG - Verifying if the vm interface deleted from vroter uve...
2026-10-05 04:03:35,780 - DEBUG - interface for vm 1c336f8a-3360-43a7-a7c8-326c7c9f1ccd deleted from vrouter uve ...
2026-10-05 04:03:35,780 - DEBUG - Deleted interface not in error interface list ...
2026-10-05 04:03:38,780 - DEBUG - Requesting: http://10.0.0.177:8081/analytics/uves/generator/an-jenkins-deploy-platform-ansible-os-6343-1:Compute:contrail-vrouter-agent:0?flat
2026-10-05 04:03:38,823 - DEBUG - Requesting: http://10.0.0.38:8081/analytics/uves/vrouter/an-jenkins-deploy-platform-ansible-os-6343-1?flat
2026-10-05 04:03:38,858 - DEBUG - VM 1c336f8a-3360-43a7-a7c8-326c7c9f1ccd is still present in vrouter an-jenkins-deploy-platform-ansible-os-6343-1 uve
2026-10-05 04:03:38,858 - DEBUG - Verifying if the vm interface deleted from vroter uve...
2026-10-05 04:03:38,858 - DEBUG - interface for vm 1c336f8a-3360-43a7-a7c8-326c7c9f1ccd deleted from vrouter uve ...
2026-10-05 04:03:38,858 - DEBUG - Deleted interface not in error interface list ...
2026-10-05 04:03:41,859 - DEBUG - Requesting: http://10.0.0.177:8081/analytics/uves/generator/an-jenkins-deploy-platform-ansible-os-6343-1:Compute:contrail-vrouter-agent:0?flat
2026-10-05 04:03:41,904 - DEBUG - Requesting: http://10.0.0.38:8081/analytics/uves/vrouter/an-jenkins-deploy-platform-ansible-os-6343-1?flat
2026-10-05 04:03:41,939 - DEBUG - VM 1c336f8a-3360-43a7-a7c8-326c7c9f1ccd is not present in vrouter an-jenkins-deploy-platform-ansible-os-6343-1 uve
2026-10-05 04:03:41,939 - DEBUG - Verifying if the vm interface deleted from vroter uve...
2026-10-05 04:03:41,940 - DEBUG - interface for vm 1c336f8a-3360-43a7-a7c8-326c7c9f1ccd deleted from vrouter uve ...
2026-10-05 04:03:41,940 - DEBUG - Deleted interface not in error interface list ...
2026-10-05 04:03:41,940 - DEBUG - Validated that VM 1c336f8a-3360-43a7-a7c8-326c7c9f1ccd is removed in Vrouter UVE
2026-10-05 04:03:41,940 - DEBUG - Verifying through opserver in 10.0.0.177
2026-10-05 04:03:41,940 - DEBUG - Requesting: http://10.0.0.177:8081/analytics/uves/virtual-network/default-domain:ctest-SecurityGroupBasicRegressionTests1_contrail-34544971:ctest-SecurityGroupBasicRegressionTests1_contrail-34544971-86249023?flat
2026-10-05 04:03:41,964 - DEBUG - 1c336f8a-3360-43a7-a7c8-326c7c9f1ccd BM not in default-domain:ctest-SecurityGroupBasicRegressionTests1_contrail-34544971:ctest-SecurityGroupBasicRegressionTests1_contrail-34544971-86249023 uve
2026-10-05 04:03:41,964 - DEBUG - Validated that VM 1c336f8a-3360-43a7-a7c8-326c7c9f1ccd is not present in the VN UVE
2026-10-05 04:03:41,965 - DEBUG - Verifying the 1c336f8a-3360-43a7-a7c8-326c7c9f1ccd virtual network link through opserver 10.0.0.177
2026-10-05 04:03:41,965 - DEBUG - Requesting: http://10.0.0.177:8081/analytics/uves/virtual-machines
2026-10-05 04:03:41,980 - INFO - 1c336f8a-3360-43a7-a7c8-326c7c9f1ccd vm uve deleted from opserver
2026-10-05 04:03:41,980 - DEBUG - Verifying the 1c336f8a-3360-43a7-a7c8-326c7c9f1ccd virtual network link through opserver 10.0.0.38
2026-10-05 04:03:41,980 - DEBUG - Requesting: http://10.0.0.38:8081/analytics/uves/virtual-machines
2026-10-05 04:03:41,994 - INFO - 1c336f8a-3360-43a7-a7c8-326c7c9f1ccd vm uve deleted from opserver
2026-10-05 04:03:41,994 - DEBUG - Verifying the 1c336f8a-3360-43a7-a7c8-326c7c9f1ccd virtual network link through opserver 10.0.0.190
2026-10-05 04:03:41,995 - DEBUG - Requesting: http://10.0.0.190:8081/analytics/uves/virtual-machines
2026-10-05 04:03:42,011 - INFO - 1c336f8a-3360-43a7-a7c8-326c7c9f1ccd vm uve deleted from opserver
2026-10-05 04:03:42,012 - INFO - Validated that VM 1c336f8a-3360-43a7-a7c8-326c7c9f1ccd is removed from Opserver
2026-10-05 04:03:42,012 - INFO - Deleting VN ctest-SecurityGroupBasicRegressionTests1_contrail-34544971-86249023
2026-10-05 04:03:42,251 - DEBUG - Response for deleting network ()
2026-10-05 04:03:42,251 - DEBUG - Requesting: http://10.0.0.177:8082/routing-instance/94919fd2-b726-480c-8a37-916ce24ca4f9
2026-10-05 04:03:42,261 - DEBUG - Response Code: 404
2026-10-05 04:03:42,262 - DEBUG - Requesting: http://10.0.0.177:8082/domains
2026-10-05 04:03:42,272 - DEBUG - Requesting: http://10.0.0.177:8082/domain/6850e378-7089-4036-8f54-55c0ed1b9054
2026-10-05 04:03:42,324 - DEBUG - Requesting: http://10.0.0.177:8082/project/cf2b70b2-743c-4124-b4b7-cb1262b0f677
2026-10-05 04:03:42,437 - INFO - Validated that VN ctest-SecurityGroupBasicRegressionTests1_contrail-34544971-86249023 is not found in API Server
2026-10-05 04:03:42,454 - DEBUG - VN ctest-SecurityGroupBasicRegressionTests1_contrail-34544971-86249023 is not present in Agent 10.0.0.50
2026-10-05 04:03:42,467 - DEBUG - VN ctest-SecurityGroupBasicRegressionTests1_contrail-34544971-86249023 is not present in Agent 10.0.0.191
2026-10-05 04:03:42,467 - INFO - Validated that VN ctest-SecurityGroupBasicRegressionTests1_contrail-34544971-86249023 is not in any agent
2026-10-05 04:03:42,505 - INFO - Validated that Routing instances and Config db in Control-nodes does not have VN ctest-SecurityGroupBasicRegressionTests1_contrail-34544971-86249023 info
2026-10-05 04:03:42,505 - INFO - Deleting Security group: ['default-domain', 'ctest-SecurityGroupBasicRegressionTests1_contrail-34544971', 'ctest-test_sec_group-71175043']
2026-10-05 04:03:42,630 - INFO - Security group: ['default-domain', 'ctest-SecurityGroupBasicRegressionTests1_contrail-34544971', 'ctest-test_sec_group-71175043'] deleted successfully.
2026-10-05 04:03:42,630 - DEBUG - Requesting: http://10.0.0.177:8082/domains
2026-10-05 04:03:42,639 - DEBUG - Requesting: http://10.0.0.177:8082/domain/6850e378-7089-4036-8f54-55c0ed1b9054
2026-10-05 04:03:42,654 - DEBUG - Requesting: http://10.0.0.177:8082/project/cf2b70b2-743c-4124-b4b7-cb1262b0f677
2026-10-05 04:03:42,754 - INFO - Security group ctest-test_sec_group-71175043 removed from the API Server
2026-10-05 04:03:42,754 - DEBUG - Requesting: http://10.0.0.177:8082/domains
2026-10-05 04:03:42,763 - DEBUG - Requesting: http://10.0.0.177:8082/domain/6850e378-7089-4036-8f54-55c0ed1b9054
2026-10-05 04:03:42,788 - DEBUG - Requesting: http://10.0.0.177:8082/project/cf2b70b2-743c-4124-b4b7-cb1262b0f677
2026-10-05 04:03:42,894 - DEBUG - Requesting: http://10.0.0.177:8082/access-control-lists
2026-10-05 04:03:42,904 - DEBUG - ACLs for Security group ctest-test_sec_group-71175043 removed from the API Server
2026-10-05 04:03:42,912 - INFO - security group ctest-test_sec_group-71175043 removed from Control-node 10.0.0.177
2026-10-05 04:03:42,920 - DEBUG - Security group ctest-test_sec_group-71175043 ACLs removed from the control node 10.0.0.177
2026-10-05 04:03:42,929 - INFO - security group ctest-test_sec_group-71175043 removed from Control-node 10.0.0.38
2026-10-05 04:03:42,936 - DEBUG - Security group ctest-test_sec_group-71175043 ACLs removed from the control node 10.0.0.38
2026-10-05 04:03:42,943 - INFO - security group ctest-test_sec_group-71175043 removed from Control-node 10.0.0.190
2026-10-05 04:03:42,952 - DEBUG - Security group ctest-test_sec_group-71175043 ACLs removed from the control node 10.0.0.190
2026-10-05 04:03:42,952 - INFO - Validated that SG ctest-test_sec_group-71175043 is not in control nodes
2026-10-05 04:03:44,255 - ERROR - AssertionError
Python 3.9.25: /usr/bin/python3
Mon Oct 5 04:03:12 2026
A problem occurred in a Python script. Here is the sequence of
function calls leading up to the error, in the order they occurred.
/contrail-test/tcutils/wrappers.py in wrapper(self=, *args=(), **kwargs={})
78 log.info('Initial checks done. Running the testcase now')
79 log.info('')
80 result = function(self, *args, **kwargs)
81 if self.inputs.upgrade:
82 pid = os.getpid()
result = None
function =
self =
args = ()
kwargs = {}
/contrail-test/scripts/securitygroup/test_regression_basic.py in test_sec_group_basic(self=)
89 assert vm1_fixture.verify_on_setup()
90 assert vm1_fixture.wait_till_vm_is_up()
91 assert vm2_fixture.verify_on_setup()
92 assert vm2_fixture.wait_till_vm_is_up()
93
vm2_fixture =
vm2_fixture.verify_on_setup = >
AssertionError:
__cause__ = None
__class__ =
__context__ = None
__delattr__ =
__dict__ = {}
__dir__ =
__doc__ = 'Assertion failed.'
__eq__ =
__format__ =
__ge__ =
__getattribute__ =
__gt__ =
__hash__ =
__init__ =
__init_subclass__ =
__le__ =
__lt__ =
__ne__ =
__new__ =
__reduce__ =
__reduce_ex__ =
__repr__ =
__setattr__ =
__setstate__ =
__sizeof__ =
__str__ =
__subclasshook__ =
__suppress_context__ = False
__traceback__ =
args = ()
with_traceback =
The above is a description of an error in a Python program. Here is
the original traceback:
Traceback (most recent call last):
File "/contrail-test/tcutils/wrappers.py", line 80, in wrapper
result = function(self, *args, **kwargs)
File "/contrail-test/scripts/securitygroup/test_regression_basic.py", line 91, in test_sec_group_basic
assert vm2_fixture.verify_on_setup()
AssertionError
2026-10-05 04:03:44,271 - DEBUG - No XMPP flaps were noticed during the test
2026-10-05 04:03:44,271 - INFO -
2026-10-05 04:03:44,271 - INFO - END TEST : test_sec_group_basic : FAILED[0:04:25]
2026-10-05 04:03:44,271 - INFO - --------------------------------------------------------------------------------
2026-10-05 04:03:45,151 - INFO - Deleted project: ctest-SecurityGroupBasicRegressionTests1_contrail-34544971, ID : cf2b70b2-743c-4124-b4b7-cb1262b0f677