2026-10-05 05:49:46,095 - INFO - Domain Default found not creating
2026-10-05 05:49:46,297 - INFO - Project ctest-FatFlowAggrIpv6Serial-78426072 not found, creating it
2026-10-05 05:49:46,903 - INFO - Created Project:ctest-FatFlowAggrIpv6Serial-78426072, ID : ec5f53ec-79ea-49a4-af89-19455039fc06
2026-10-05 05:49:48,800 - INFO - ================================================================================
2026-10-05 05:49:48,801 - INFO - STARTING TEST : test_fat_flow_aggr_dest_udp_inter_vn_inter_node
2026-10-05 05:49:48,801 - INFO - TEST DESCRIPTION :
Description: Verify fat flow prefix aggr dest (IPv6) for intra-vn inter-node
Steps:
1. Create 2 VNs with IPv6 subnets and launch 3 VMs.2 client VMs in VN1 on same node
and server VM in VN2 on different node.
Client 1 in subnet 1, Client 2 in the next subnet.
Policy p1 configured to allow udp traffic between VN1 and VN2.
2. On server VM, config fat flow aggr prefix dest IPv6 len 125 for UDP port 55.
3. From both the client VMs, send ICMP6 traffic to the server VM twice with diff. src ports
Pass criteria:
1. On the remote CN, expect 2 pairs ( 1 for client 1, 1 for client 2)
of IPv6 fat flows with prefix aggregated for the src IPs
(VM to fabric, Prefix Aggr Dest: Aggregation happens for SRC IPs)
2. On client VM compute nodes, expect 4 pairs of IPv6 flows and on server compute,
expect 2 pairs of IPv6 flows
3. On server compute node, flow's source port should be 0 for fat flows
Maintainer: Ankitja@juniper.net
2026-10-05 05:49:50,127 - DEBUG - Skipping xmpp flap check
2026-10-05 05:49:50,127 - INFO - Initial checks done. Running the testcase now
2026-10-05 05:49:50,127 - INFO -
2026-10-05 05:49:50,127 - INFO - ================================================================================
2026-10-05 05:49:50,127 - INFO - STARTING TEST : test_fat_flow_aggr_dest_udp_inter_vn_inter_node
2026-10-05 05:49:50,127 - INFO - TEST DESCRIPTION : :
Description: Verify fat flow prefix aggr dest (IPv4) for intra-vn inter-node
Steps:
1. Create 2 VNs and launch 3 VMs.2 client VMs in VN1 on same node
and server VM in VN2 on different node.
Client 1 in subnet 1, Client 2 in the next subnet.
Policy p1 configured to allow udp traffic between VN1 and VN2.
2. On server VM, config fat flow aggr prefix dest len 29 for UDP port 55.
3. From both the client VMs, send ICMP traffic to the server VM twice with diff. src ports
Pass criteria:
1. On the remote CN, expect 2 pairs ( 1 for client 1, 1 for client 2)
of fat flows with prefix aggregated for the src IPs
(VM to fabric, Prefix Aggr Dest: Aggregation happens for SRC IPs)
2. On client VM compute nodes, expect 4 pairs of flows and on server compute,
expect 2 pairs of flows
3. On server compute node, flow's source port should be 0 for fat flows
Maintainer: Ankitja@juniper.net
2026-10-05 05:49:51,439 - DEBUG - Skipping xmpp flap check
2026-10-05 05:49:51,440 - INFO - Initial checks done. Running the testcase now
2026-10-05 05:49:51,440 - INFO -
2026-10-05 05:49:51,468 - DEBUG - Services list from nova: [, , , ]
2026-10-05 05:49:51,468 - DEBUG - Hosts: {'nova': ['an-jenkins-deploy-platform-ansible-os-6343-1', 'an-jenkins-deploy-platform-ansible-os-6343-2']}
2026-10-05 05:49:52,387 - DEBUG - Response for create_network : {'network': {'id': '63769265-bec8-430b-ac72-e69892a12ed5', 'name': 'ctest-vn-41016508', 'tenant_id': 'ec5f53ec79ea49a4af8919455039fc06', 'project_id': 'ec5f53ec79ea49a4af8919455039fc06', 'admin_state_up': True, 'shared': False, 'status': 'ACTIVE', 'router:external': False, 'mtu': 0, 'tags': [], 'subnets': [], 'fq_name': ['default-domain', 'ctest-FatFlowAggrIpv6Serial-78426072', 'ctest-vn-41016508'], 'port_security_enabled': True, 'description': ''}}
2026-10-05 05:49:52,766 - DEBUG - Response for create_subnet : {'subnet': {'id': '3923efa7-7d78-4ece-b6e4-64d4b634a9a7', 'name': '', 'tenant_id': 'ec5f53ec79ea49a4af8919455039fc06', 'network_id': '63769265-bec8-430b-ac72-e69892a12ed5', 'ip_version': 4, 'cidr': '90.218.6.0/26', 'allocation_pools': [{'start': '90.218.6.2', 'end': '90.218.6.62'}], 'gateway_ip': '90.218.6.1', 'enable_dhcp': True, 'ipv6_ra_mode': None, 'ipv6_address_mode': None, 'dns_nameservers': [], 'host_routes': [], 'dns_server_address': '90.218.6.2', 'tags': [], 'project_id': 'ec5f53ec79ea49a4af8919455039fc06'}}
2026-10-05 05:49:52,984 - DEBUG - Response for create_subnet : {'subnet': {'id': '5a0aacb7-44b3-424b-8ea3-ff71c440986e', 'name': '', 'tenant_id': 'ec5f53ec79ea49a4af8919455039fc06', 'network_id': '63769265-bec8-430b-ac72-e69892a12ed5', 'ip_version': 6, 'cidr': '3f71:87a7:6994:3b7:6006:4b2::/96', 'allocation_pools': [{'start': '3f71:87a7:6994:3b7:6006:4b2:0:2', 'end': '3f71:87a7:6994:3b7:6006:4b2:ffff:fffe'}], 'gateway_ip': '3f71:87a7:6994:3b7:6006:4b2:0:1', 'enable_dhcp': True, 'ipv6_ra_mode': None, 'ipv6_address_mode': None, 'dns_nameservers': [], 'host_routes': [], 'dns_server_address': '3f71:87a7:6994:3b7:6006:4b2:0:2', 'tags': [], 'project_id': 'ec5f53ec79ea49a4af8919455039fc06'}}
2026-10-05 05:49:53,014 - INFO - Created VN ctest-vn-41016508
2026-10-05 05:49:53,029 - DEBUG - VN ctest-vn-41016508 UUID is 63769265-bec8-430b-ac72-e69892a12ed5
2026-10-05 05:49:53,461 - DEBUG - Response for create_network : {'network': {'id': '5c3bd4d6-86be-40d4-81e9-7300d8fe4d29', 'name': 'ctest-vn-03532694', 'tenant_id': 'ec5f53ec79ea49a4af8919455039fc06', 'project_id': 'ec5f53ec79ea49a4af8919455039fc06', 'admin_state_up': True, 'shared': False, 'status': 'ACTIVE', 'router:external': False, 'mtu': 0, 'tags': [], 'subnets': [], 'fq_name': ['default-domain', 'ctest-FatFlowAggrIpv6Serial-78426072', 'ctest-vn-03532694'], 'port_security_enabled': True, 'description': ''}}
2026-10-05 05:49:53,708 - DEBUG - Response for create_subnet : {'subnet': {'id': '0416a4f4-9b92-4895-b753-b78fc762c8f9', 'name': '', 'tenant_id': 'ec5f53ec79ea49a4af8919455039fc06', 'network_id': '5c3bd4d6-86be-40d4-81e9-7300d8fe4d29', 'ip_version': 4, 'cidr': '63.241.178.192/26', 'allocation_pools': [{'start': '63.241.178.194', 'end': '63.241.178.254'}], 'gateway_ip': '63.241.178.193', 'enable_dhcp': True, 'ipv6_ra_mode': None, 'ipv6_address_mode': None, 'dns_nameservers': [], 'host_routes': [], 'dns_server_address': '63.241.178.194', 'tags': [], 'project_id': 'ec5f53ec79ea49a4af8919455039fc06'}}
2026-10-05 05:49:53,972 - DEBUG - Response for create_subnet : {'subnet': {'id': '6744190f-028f-4244-8089-13ae599fd51b', 'name': '', 'tenant_id': 'ec5f53ec79ea49a4af8919455039fc06', 'network_id': '5c3bd4d6-86be-40d4-81e9-7300d8fe4d29', 'ip_version': 6, 'cidr': '2fbb:1bf8:4bb4:653c:ab8b:aad0::/96', 'allocation_pools': [{'start': '2fbb:1bf8:4bb4:653c:ab8b:aad0:0:2', 'end': '2fbb:1bf8:4bb4:653c:ab8b:aad0:ffff:fffe'}], 'gateway_ip': '2fbb:1bf8:4bb4:653c:ab8b:aad0:0:1', 'enable_dhcp': True, 'ipv6_ra_mode': None, 'ipv6_address_mode': None, 'dns_nameservers': [], 'host_routes': [], 'dns_server_address': '2fbb:1bf8:4bb4:653c:ab8b:aad0:0:2', 'tags': [], 'project_id': 'ec5f53ec79ea49a4af8919455039fc06'}}
2026-10-05 05:49:54,001 - INFO - Created VN ctest-vn-03532694
2026-10-05 05:49:54,018 - DEBUG - VN ctest-vn-03532694 UUID is 5c3bd4d6-86be-40d4-81e9-7300d8fe4d29
2026-10-05 05:49:54,135 - DEBUG - Requesting: http://10.0.0.177:8082/domains
2026-10-05 05:49:54,513 - DEBUG - Requesting: http://10.0.0.177:8082/domains
2026-10-05 05:49:54,548 - DEBUG - Requesting: http://10.0.0.177:8082/domain/6850e378-7089-4036-8f54-55c0ed1b9054
2026-10-05 05:49:54,572 - DEBUG - Requesting: http://10.0.0.177:8082/project/ec5f53ec-79ea-49a4-af89-19455039fc06
2026-10-05 05:49:54,678 - DEBUG - Requesting: http://10.0.0.177:8082/virtual-network/63769265-bec8-430b-ac72-e69892a12ed5
2026-10-05 05:49:54,693 - DEBUG - Requesting: http://10.0.0.177:8082/virtual-network/63769265-bec8-430b-ac72-e69892a12ed5
2026-10-05 05:49:54,706 - DEBUG - Requesting: http://10.0.0.177:8082/routing-instance/828ee64d-d4e7-407c-8030-db9e89383e48
2026-10-05 05:49:54,721 - DEBUG - Requesting: http://10.0.0.177:8082/routing-instance/828ee64d-d4e7-407c-8030-db9e89383e48
2026-10-05 05:49:54,732 - DEBUG - Requesting: http://10.0.0.177:8082/route-target/02d95ed9-31b8-4396-b5b0-64f5eeac936a
2026-10-05 05:49:54,743 - DEBUG - Route Targets: ['target:64512:8000013']
2026-10-05 05:49:54,743 - DEBUG - Requesting: http://10.0.0.177:8082/virtual-network/63769265-bec8-430b-ac72-e69892a12ed5
2026-10-05 05:49:54,757 - DEBUG - Requesting: http://10.0.0.177:8082/routing-instance/828ee64d-d4e7-407c-8030-db9e89383e48
2026-10-05 05:49:54,783 - INFO - Verified VN network id 22 for VN 63769265-bec8-430b-ac72-e69892a12ed5
2026-10-05 05:49:54,783 - INFO - Verifications in API Server for VN ctest-vn-41016508 passed
2026-10-05 05:49:54,784 - DEBUG - Requesting: http://10.0.0.177:8082/virtual-network/63769265-bec8-430b-ac72-e69892a12ed5
2026-10-05 05:49:54,801 - DEBUG - Requesting: http://10.0.0.177:8082/routing-instance/828ee64d-d4e7-407c-8030-db9e89383e48
2026-10-05 05:49:54,812 - DEBUG - Requesting: http://10.0.0.177:8082/routing-instance/828ee64d-d4e7-407c-8030-db9e89383e48
2026-10-05 05:49:54,822 - DEBUG - Requesting: http://10.0.0.177:8082/route-target/02d95ed9-31b8-4396-b5b0-64f5eeac936a
2026-10-05 05:49:54,839 - DEBUG - Control-node 10.0.0.177 : VN object is : {'node_name': 'virtual-network:default-domain:ctest-FatFlowAggrIpv6Serial-78426072:ctest-vn-41016508', 'interests': '-', 'advertised': '-', 'dbentryflags': None, 'obj_info': {'sequence_number': '0', 'origin': 'Cassandra', 'data': {'id-perms': {'permissions': {'owner': 'ctest-FatFlowAggrIpv6Serial-78426072', 'owner-access': '7', 'group': 'reader', 'group-access': '7', 'other-access': '7'}, 'uuid': {'uuid-mslong': '7167076822696870667', 'uuid-lslong': '12426247864838074069'}, 'enable': 'true', 'created': '2026-10-05T05:49:52', 'last-modified': '2026-10-05T05:49:52', 'description': None, 'user-visible': 'true', 'creator': None}}}, 'neighbors': None, 'last_modified': '00:00:01.913173'}
2026-10-05 05:49:54,847 - DEBUG - Route Targets: ['target:64512:8000013']
2026-10-05 05:49:54,855 - DEBUG - Control-node 10.0.0.38 : VN object is : {'node_name': 'virtual-network:default-domain:ctest-FatFlowAggrIpv6Serial-78426072:ctest-vn-41016508', 'interests': '-', 'advertised': '-', 'dbentryflags': None, 'obj_info': {'sequence_number': '0', 'origin': 'Cassandra', 'data': {'id-perms': {'permissions': {'owner': 'ctest-FatFlowAggrIpv6Serial-78426072', 'owner-access': '7', 'group': 'reader', 'group-access': '7', 'other-access': '7'}, 'uuid': {'uuid-mslong': '7167076822696870667', 'uuid-lslong': '12426247864838074069'}, 'enable': 'true', 'created': '2026-10-05T05:49:52', 'last-modified': '2026-10-05T05:49:52', 'description': None, 'user-visible': 'true', 'creator': None}}}, 'neighbors': None, 'last_modified': '00:00:01.934397'}
2026-10-05 05:49:54,864 - DEBUG - Route Targets: ['target:64512:8000013']
2026-10-05 05:49:54,873 - DEBUG - Control-node 10.0.0.190 : VN object is : {'node_name': 'virtual-network:default-domain:ctest-FatFlowAggrIpv6Serial-78426072:ctest-vn-41016508', 'interests': '-', 'advertised': '-', 'dbentryflags': None, 'obj_info': {'sequence_number': '0', 'origin': 'Cassandra', 'data': {'id-perms': {'permissions': {'owner': 'ctest-FatFlowAggrIpv6Serial-78426072', 'owner-access': '7', 'group': 'reader', 'group-access': '7', 'other-access': '7'}, 'uuid': {'uuid-mslong': '7167076822696870667', 'uuid-lslong': '12426247864838074069'}, 'enable': 'true', 'created': '2026-10-05T05:49:52', 'last-modified': '2026-10-05T05:49:52', 'description': None, 'user-visible': 'true', 'creator': None}}}, 'neighbors': None, 'last_modified': '00:00:01.952123'}
2026-10-05 05:49:54,883 - DEBUG - Route Targets: ['target:64512:8000013']
2026-10-05 05:49:54,884 - INFO - On all control nodes, Config, RI and RT verification for VN ctest-vn-41016508 passed
2026-10-05 05:49:54,884 - DEBUG - ====Verifying policy data for ctest-vn-41016508 in API_Server ======
2026-10-05 05:49:54,884 - DEBUG - Requesting: http://10.0.0.177:8082/domains
2026-10-05 05:49:54,894 - DEBUG - Requesting: http://10.0.0.177:8082/domain/6850e378-7089-4036-8f54-55c0ed1b9054
2026-10-05 05:49:54,908 - DEBUG - Requesting: http://10.0.0.177:8082/project/ec5f53ec-79ea-49a4-af89-19455039fc06
2026-10-05 05:49:55,016 - DEBUG - Requesting: http://10.0.0.177:8082/virtual-network/63769265-bec8-430b-ac72-e69892a12ed5
2026-10-05 05:49:55,028 - DEBUG - =>VN ctest-vn-41016508 has no policy to be verified
2026-10-05 05:49:55,028 - DEBUG - Verifying the vn in opserver
2026-10-05 05:49:55,028 - DEBUG - Verifying the default-domain:ctest-FatFlowAggrIpv6Serial-78426072:ctest-vn-41016508 virtual network link through opserver 10.0.0.177
2026-10-05 05:49:55,028 - DEBUG - Requesting: http://10.0.0.177:8081/analytics/uves/virtual-networks
2026-10-05 05:49:55,414 - DEBUG - Requesting: http://10.0.0.177:8081/analytics/uves/virtual-networks
2026-10-05 05:49:55,491 - DEBUG - vn link and name as {'name': 'default-domain:ctest-FatFlowAggrIpv6Serial-78426072:ctest-vn-41016508', 'href': 'http://10.0.0.177:8081/analytics/uves/virtual-network/default-domain:ctest-FatFlowAggrIpv6Serial-78426072:ctest-vn-41016508?flat'}
2026-10-05 05:49:55,491 - DEBUG - Verifying the default-domain:ctest-FatFlowAggrIpv6Serial-78426072:ctest-vn-41016508 virtual network link through opserver 10.0.0.38
2026-10-05 05:49:55,492 - DEBUG - Requesting: http://10.0.0.38:8081/analytics/uves/virtual-networks
2026-10-05 05:49:55,868 - DEBUG - Requesting: http://10.0.0.38:8081/analytics/uves/virtual-networks
2026-10-05 05:49:55,936 - DEBUG - vn link and name as {'name': 'default-domain:ctest-FatFlowAggrIpv6Serial-78426072:ctest-vn-41016508', 'href': 'http://10.0.0.38:8081/analytics/uves/virtual-network/default-domain:ctest-FatFlowAggrIpv6Serial-78426072:ctest-vn-41016508?flat'}
2026-10-05 05:49:55,936 - DEBUG - Verifying the default-domain:ctest-FatFlowAggrIpv6Serial-78426072:ctest-vn-41016508 virtual network link through opserver 10.0.0.190
2026-10-05 05:49:55,936 - DEBUG - Requesting: http://10.0.0.190:8081/analytics/uves/virtual-networks
2026-10-05 05:49:56,318 - DEBUG - Requesting: http://10.0.0.190:8081/analytics/uves/virtual-networks
2026-10-05 05:49:56,393 - DEBUG - vn link and name as {'name': 'default-domain:ctest-FatFlowAggrIpv6Serial-78426072:ctest-vn-41016508', 'href': 'http://10.0.0.190:8081/analytics/uves/virtual-network/default-domain:ctest-FatFlowAggrIpv6Serial-78426072:ctest-vn-41016508?flat'}
2026-10-05 05:49:56,393 - INFO - Validated that VN default-domain:ctest-FatFlowAggrIpv6Serial-78426072:ctest-vn-41016508 is found in opserver
2026-10-05 05:49:56,421 - DEBUG - Do not have enough data to verify VN in agent
2026-10-05 05:49:56,435 - DEBUG - VRF ids for VN ctest-vn-41016508: {}
2026-10-05 05:49:56,435 - DEBUG - Requesting: http://10.0.0.177:8082/domains
2026-10-05 05:49:56,443 - DEBUG - Requesting: http://10.0.0.177:8082/domain/6850e378-7089-4036-8f54-55c0ed1b9054
2026-10-05 05:49:56,458 - DEBUG - Requesting: http://10.0.0.177:8082/project/ec5f53ec-79ea-49a4-af89-19455039fc06
2026-10-05 05:49:56,562 - DEBUG - Requesting: http://10.0.0.177:8082/virtual-network/5c3bd4d6-86be-40d4-81e9-7300d8fe4d29
2026-10-05 05:49:56,577 - DEBUG - Requesting: http://10.0.0.177:8082/virtual-network/5c3bd4d6-86be-40d4-81e9-7300d8fe4d29
2026-10-05 05:49:56,589 - DEBUG - Requesting: http://10.0.0.177:8082/routing-instance/7c4e4996-6828-4976-91ea-8fb9744a8240
2026-10-05 05:49:56,599 - DEBUG - Requesting: http://10.0.0.177:8082/routing-instance/7c4e4996-6828-4976-91ea-8fb9744a8240
2026-10-05 05:49:56,608 - DEBUG - Requesting: http://10.0.0.177:8082/route-target/9edf0324-9e28-40ad-8889-25c12619b45a
2026-10-05 05:49:56,617 - DEBUG - Route Targets: ['target:64512:8000014']
2026-10-05 05:49:56,617 - DEBUG - Requesting: http://10.0.0.177:8082/virtual-network/5c3bd4d6-86be-40d4-81e9-7300d8fe4d29
2026-10-05 05:49:56,628 - DEBUG - Requesting: http://10.0.0.177:8082/routing-instance/7c4e4996-6828-4976-91ea-8fb9744a8240
2026-10-05 05:49:56,647 - INFO - Verified VN network id 23 for VN 5c3bd4d6-86be-40d4-81e9-7300d8fe4d29
2026-10-05 05:49:56,647 - INFO - Verifications in API Server for VN ctest-vn-03532694 passed
2026-10-05 05:49:56,648 - DEBUG - Requesting: http://10.0.0.177:8082/virtual-network/5c3bd4d6-86be-40d4-81e9-7300d8fe4d29
2026-10-05 05:49:56,660 - DEBUG - Requesting: http://10.0.0.177:8082/routing-instance/7c4e4996-6828-4976-91ea-8fb9744a8240
2026-10-05 05:49:56,669 - DEBUG - Requesting: http://10.0.0.177:8082/routing-instance/7c4e4996-6828-4976-91ea-8fb9744a8240
2026-10-05 05:49:56,678 - DEBUG - Requesting: http://10.0.0.177:8082/route-target/9edf0324-9e28-40ad-8889-25c12619b45a
2026-10-05 05:49:56,695 - DEBUG - Control-node 10.0.0.177 : VN object is : {'node_name': 'virtual-network:default-domain:ctest-FatFlowAggrIpv6Serial-78426072:ctest-vn-03532694', 'interests': '-', 'advertised': '-', 'dbentryflags': None, 'obj_info': {'sequence_number': '0', 'origin': 'Cassandra', 'data': {'id-perms': {'permissions': {'owner': 'ctest-FatFlowAggrIpv6Serial-78426072', 'owner-access': '7', 'group': 'reader', 'group-access': '7', 'other-access': '7'}, 'uuid': {'uuid-mslong': '6646139692964004052', 'uuid-lslong': '9361139747944025385'}, 'enable': 'true', 'created': '2026-10-05T05:49:53', 'last-modified': '2026-10-05T05:49:53', 'description': None, 'user-visible': 'true', 'creator': None}}}, 'neighbors': None, 'last_modified': '00:00:02.779393'}
2026-10-05 05:49:56,701 - DEBUG - Route Targets: ['target:64512:8000014']
2026-10-05 05:49:56,709 - DEBUG - Control-node 10.0.0.38 : VN object is : {'node_name': 'virtual-network:default-domain:ctest-FatFlowAggrIpv6Serial-78426072:ctest-vn-03532694', 'interests': '-', 'advertised': '-', 'dbentryflags': None, 'obj_info': {'sequence_number': '0', 'origin': 'Cassandra', 'data': {'id-perms': {'permissions': {'owner': 'ctest-FatFlowAggrIpv6Serial-78426072', 'owner-access': '7', 'group': 'reader', 'group-access': '7', 'other-access': '7'}, 'uuid': {'uuid-mslong': '6646139692964004052', 'uuid-lslong': '9361139747944025385'}, 'enable': 'true', 'created': '2026-10-05T05:49:53', 'last-modified': '2026-10-05T05:49:53', 'description': None, 'user-visible': 'true', 'creator': None}}}, 'neighbors': None, 'last_modified': '00:00:02.800593'}
2026-10-05 05:49:56,720 - DEBUG - Route Targets: ['target:64512:8000014']
2026-10-05 05:49:56,727 - DEBUG - Control-node 10.0.0.190 : VN object is : {'node_name': 'virtual-network:default-domain:ctest-FatFlowAggrIpv6Serial-78426072:ctest-vn-03532694', 'interests': '-', 'advertised': '-', 'dbentryflags': None, 'obj_info': {'sequence_number': '0', 'origin': 'Cassandra', 'data': {'id-perms': {'permissions': {'owner': 'ctest-FatFlowAggrIpv6Serial-78426072', 'owner-access': '7', 'group': 'reader', 'group-access': '7', 'other-access': '7'}, 'uuid': {'uuid-mslong': '6646139692964004052', 'uuid-lslong': '9361139747944025385'}, 'enable': 'true', 'created': '2026-10-05T05:49:53', 'last-modified': '2026-10-05T05:49:53', 'description': None, 'user-visible': 'true', 'creator': None}}}, 'neighbors': None, 'last_modified': '00:00:02.814493'}
2026-10-05 05:49:56,735 - DEBUG - Route Targets: ['target:64512:8000014']
2026-10-05 05:49:56,735 - INFO - On all control nodes, Config, RI and RT verification for VN ctest-vn-03532694 passed
2026-10-05 05:49:56,735 - DEBUG - ====Verifying policy data for ctest-vn-03532694 in API_Server ======
2026-10-05 05:49:56,735 - DEBUG - Requesting: http://10.0.0.177:8082/domains
2026-10-05 05:49:56,743 - DEBUG - Requesting: http://10.0.0.177:8082/domain/6850e378-7089-4036-8f54-55c0ed1b9054
2026-10-05 05:49:56,757 - DEBUG - Requesting: http://10.0.0.177:8082/project/ec5f53ec-79ea-49a4-af89-19455039fc06
2026-10-05 05:49:56,865 - DEBUG - Requesting: http://10.0.0.177:8082/virtual-network/5c3bd4d6-86be-40d4-81e9-7300d8fe4d29
2026-10-05 05:49:56,877 - DEBUG - =>VN ctest-vn-03532694 has no policy to be verified
2026-10-05 05:49:56,877 - DEBUG - Verifying the vn in opserver
2026-10-05 05:49:56,877 - DEBUG - Verifying the default-domain:ctest-FatFlowAggrIpv6Serial-78426072:ctest-vn-03532694 virtual network link through opserver 10.0.0.177
2026-10-05 05:49:56,878 - DEBUG - Requesting: http://10.0.0.177:8081/analytics/uves/virtual-networks
2026-10-05 05:49:56,935 - DEBUG - vn link and name as {'name': 'default-domain:ctest-FatFlowAggrIpv6Serial-78426072:ctest-vn-03532694', 'href': 'http://10.0.0.177:8081/analytics/uves/virtual-network/default-domain:ctest-FatFlowAggrIpv6Serial-78426072:ctest-vn-03532694?flat'}
2026-10-05 05:49:56,935 - DEBUG - Verifying the default-domain:ctest-FatFlowAggrIpv6Serial-78426072:ctest-vn-03532694 virtual network link through opserver 10.0.0.38
2026-10-05 05:49:56,935 - DEBUG - Requesting: http://10.0.0.38:8081/analytics/uves/virtual-networks
2026-10-05 05:49:56,993 - DEBUG - vn link and name as {'name': 'default-domain:ctest-FatFlowAggrIpv6Serial-78426072:ctest-vn-03532694', 'href': 'http://10.0.0.38:8081/analytics/uves/virtual-network/default-domain:ctest-FatFlowAggrIpv6Serial-78426072:ctest-vn-03532694?flat'}
2026-10-05 05:49:56,993 - DEBUG - Verifying the default-domain:ctest-FatFlowAggrIpv6Serial-78426072:ctest-vn-03532694 virtual network link through opserver 10.0.0.190
2026-10-05 05:49:56,993 - DEBUG - Requesting: http://10.0.0.190:8081/analytics/uves/virtual-networks
2026-10-05 05:49:57,069 - DEBUG - vn link and name as {'name': 'default-domain:ctest-FatFlowAggrIpv6Serial-78426072:ctest-vn-03532694', 'href': 'http://10.0.0.190:8081/analytics/uves/virtual-network/default-domain:ctest-FatFlowAggrIpv6Serial-78426072:ctest-vn-03532694?flat'}
2026-10-05 05:49:57,069 - INFO - Validated that VN default-domain:ctest-FatFlowAggrIpv6Serial-78426072:ctest-vn-03532694 is found in opserver
2026-10-05 05:49:57,101 - DEBUG - Do not have enough data to verify VN in agent
2026-10-05 05:49:57,117 - DEBUG - VRF ids for VN ctest-vn-03532694: {}
2026-10-05 05:49:57,234 - DEBUG - Hosts: {'nova': ['an-jenkins-deploy-platform-ansible-os-6343-1', 'an-jenkins-deploy-platform-ansible-os-6343-2']}
2026-10-05 05:49:58,402 - INFO - VM ([]) created on node: (an-jenkins-deploy-platform-ansible-os-6343-1), Zone: (nova:an-jenkins-deploy-platform-ansible-os-6343-1)
2026-10-05 05:49:58,402 - INFO - Waiting for VM ctest-FatFlowAggrIpv6Serial-78426072-99604538 to be up..
2026-10-05 05:49:58,447 - DEBUG - VM is still in BUILD state, Expected: ACTIVE
2026-10-05 05:50:03,564 - DEBUG - VM is still in BUILD state, Expected: ACTIVE
2026-10-05 05:50:08,671 - DEBUG - VM is still in BUILD state, Expected: ACTIVE
2026-10-05 05:50:13,789 - DEBUG - VM is still in BUILD state, Expected: ACTIVE
2026-10-05 05:50:18,898 - DEBUG - VM is still in BUILD state, Expected: ACTIVE
2026-10-05 05:50:24,004 - DEBUG - VM is still in BUILD state, Expected: ACTIVE
2026-10-05 05:50:29,118 - DEBUG - VM is in ACTIVE state now
2026-10-05 05:50:29,118 - INFO - VM name : ctest-FatFlowAggrIpv6Serial-78426072-99604538
2026-10-05 05:50:29,221 - DEBUG - VM ctest-FatFlowAggrIpv6Serial-78426072-99604538 ID is 9bb735a9-21bb-4703-b618-2234ea09e520
2026-10-05 05:50:29,275 - DEBUG - VM ctest-FatFlowAggrIpv6Serial-78426072-99604538 launched on Node an-jenkins-deploy-platform-ansible-os-6343-1
2026-10-05 05:50:29,403 - DEBUG - Requesting: http://10.0.0.190:8082/virtual-machine/9bb735a9-21bb-4703-b618-2234ea09e520
2026-10-05 05:50:29,799 - DEBUG - Requesting: http://10.0.0.190:8082/virtual-machine/9bb735a9-21bb-4703-b618-2234ea09e520
2026-10-05 05:50:29,843 - DEBUG - Requesting: http://10.0.0.190:8082/virtual-machine-interface/52c17612-7ba5-48fd-8bd9-e023aaf2d1e8
2026-10-05 05:50:33,061 - DEBUG - (True, 'PING 169.254.0.7 (169.254.0.7) 56(84) bytes of data.\r\n\r\n--- 169.254.0.7 ping statistics ---\r\n2 packets transmitted, 0 received, 100% packet loss, time 1033ms')
2026-10-05 05:50:33,061 - DEBUG - Ping to Metadata IP 169.254.0.7 of VM ctest-FatFlowAggrIpv6Serial-78426072-99604538 failed!
2026-10-05 05:50:33,082 - DEBUG - Gateway for vn default-domain:ctest-FatFlowAggrIpv6Serial-78426072:ctest-vn-41016508 is 90.218.6.1 and allocation pool is NOT set
2026-10-05 05:50:33,082 - DEBUG - Gateway for vn default-domain:ctest-FatFlowAggrIpv6Serial-78426072:ctest-vn-41016508 is 3f71:87a7:6994:3b7:6006:4b2:0:1 and allocation pool is NOT set
2026-10-05 05:50:37,150 - DEBUG - (True, 'PING 169.254.0.7 (169.254.0.7) 56(84) bytes of data.\r\n\r\n--- 169.254.0.7 ping statistics ---\r\n2 packets transmitted, 0 received, 100% packet loss, time 1005ms')
2026-10-05 05:50:37,151 - DEBUG - Ping to Metadata IP 169.254.0.7 of VM ctest-FatFlowAggrIpv6Serial-78426072-99604538 failed!
2026-10-05 05:50:37,170 - DEBUG - Gateway for vn default-domain:ctest-FatFlowAggrIpv6Serial-78426072:ctest-vn-41016508 is 90.218.6.1 and allocation pool is NOT set
2026-10-05 05:50:37,170 - DEBUG - Gateway for vn default-domain:ctest-FatFlowAggrIpv6Serial-78426072:ctest-vn-41016508 is 3f71:87a7:6994:3b7:6006:4b2:0:1 and allocation pool is NOT set
2026-10-05 05:50:41,252 - DEBUG - (True, 'PING 169.254.0.7 (169.254.0.7) 56(84) bytes of data.\r\n\r\n--- 169.254.0.7 ping statistics ---\r\n2 packets transmitted, 0 received, 100% packet loss, time 1010ms')
2026-10-05 05:50:41,252 - DEBUG - Ping to Metadata IP 169.254.0.7 of VM ctest-FatFlowAggrIpv6Serial-78426072-99604538 failed!
2026-10-05 05:50:41,272 - DEBUG - Gateway for vn default-domain:ctest-FatFlowAggrIpv6Serial-78426072:ctest-vn-41016508 is 90.218.6.1 and allocation pool is NOT set
2026-10-05 05:50:41,272 - DEBUG - Gateway for vn default-domain:ctest-FatFlowAggrIpv6Serial-78426072:ctest-vn-41016508 is 3f71:87a7:6994:3b7:6006:4b2:0:1 and allocation pool is NOT set
2026-10-05 05:50:45,339 - DEBUG - (True, 'PING 169.254.0.7 (169.254.0.7) 56(84) bytes of data.\r\n\r\n--- 169.254.0.7 ping statistics ---\r\n2 packets transmitted, 0 received, 100% packet loss, time 1008ms')
2026-10-05 05:50:45,339 - DEBUG - Ping to Metadata IP 169.254.0.7 of VM ctest-FatFlowAggrIpv6Serial-78426072-99604538 failed!
2026-10-05 05:50:45,358 - DEBUG - Gateway for vn default-domain:ctest-FatFlowAggrIpv6Serial-78426072:ctest-vn-41016508 is 90.218.6.1 and allocation pool is NOT set
2026-10-05 05:50:45,358 - DEBUG - Gateway for vn default-domain:ctest-FatFlowAggrIpv6Serial-78426072:ctest-vn-41016508 is 3f71:87a7:6994:3b7:6006:4b2:0:1 and allocation pool is NOT set
2026-10-05 05:50:49,444 - DEBUG - (True, 'PING 169.254.0.7 (169.254.0.7) 56(84) bytes of data.\r\n\r\n--- 169.254.0.7 ping statistics ---\r\n2 packets transmitted, 0 received, 100% packet loss, time 1016ms')
2026-10-05 05:50:49,445 - DEBUG - Ping to Metadata IP 169.254.0.7 of VM ctest-FatFlowAggrIpv6Serial-78426072-99604538 failed!
2026-10-05 05:50:49,463 - DEBUG - Gateway for vn default-domain:ctest-FatFlowAggrIpv6Serial-78426072:ctest-vn-41016508 is 90.218.6.1 and allocation pool is NOT set
2026-10-05 05:50:49,463 - DEBUG - Gateway for vn default-domain:ctest-FatFlowAggrIpv6Serial-78426072:ctest-vn-41016508 is 3f71:87a7:6994:3b7:6006:4b2:0:1 and allocation pool is NOT set
2026-10-05 05:50:53,535 - DEBUG - (True, 'PING 169.254.0.7 (169.254.0.7) 56(84) bytes of data.\r\n\r\n--- 169.254.0.7 ping statistics ---\r\n2 packets transmitted, 0 received, 100% packet loss, time 1009ms')
2026-10-05 05:50:53,536 - DEBUG - Ping to Metadata IP 169.254.0.7 of VM ctest-FatFlowAggrIpv6Serial-78426072-99604538 failed!
2026-10-05 05:50:53,556 - DEBUG - Gateway for vn default-domain:ctest-FatFlowAggrIpv6Serial-78426072:ctest-vn-41016508 is 90.218.6.1 and allocation pool is NOT set
2026-10-05 05:50:53,556 - DEBUG - Gateway for vn default-domain:ctest-FatFlowAggrIpv6Serial-78426072:ctest-vn-41016508 is 3f71:87a7:6994:3b7:6006:4b2:0:1 and allocation pool is NOT set
2026-10-05 05:50:57,634 - DEBUG - (True, 'PING 169.254.0.7 (169.254.0.7) 56(84) bytes of data.\r\n\r\n--- 169.254.0.7 ping statistics ---\r\n2 packets transmitted, 0 received, 100% packet loss, time 1010ms')
2026-10-05 05:50:57,634 - DEBUG - Ping to Metadata IP 169.254.0.7 of VM ctest-FatFlowAggrIpv6Serial-78426072-99604538 failed!
2026-10-05 05:50:57,652 - DEBUG - Gateway for vn default-domain:ctest-FatFlowAggrIpv6Serial-78426072:ctest-vn-41016508 is 90.218.6.1 and allocation pool is NOT set
2026-10-05 05:50:57,652 - DEBUG - Gateway for vn default-domain:ctest-FatFlowAggrIpv6Serial-78426072:ctest-vn-41016508 is 3f71:87a7:6994:3b7:6006:4b2:0:1 and allocation pool is NOT set
2026-10-05 05:51:01,727 - DEBUG - (True, 'PING 169.254.0.7 (169.254.0.7) 56(84) bytes of data.\r\n\r\n--- 169.254.0.7 ping statistics ---\r\n2 packets transmitted, 0 received, 100% packet loss, time 1010ms')
2026-10-05 05:51:01,727 - DEBUG - Ping to Metadata IP 169.254.0.7 of VM ctest-FatFlowAggrIpv6Serial-78426072-99604538 failed!
2026-10-05 05:51:01,748 - DEBUG - Gateway for vn default-domain:ctest-FatFlowAggrIpv6Serial-78426072:ctest-vn-41016508 is 90.218.6.1 and allocation pool is NOT set
2026-10-05 05:51:01,748 - DEBUG - Gateway for vn default-domain:ctest-FatFlowAggrIpv6Serial-78426072:ctest-vn-41016508 is 3f71:87a7:6994:3b7:6006:4b2:0:1 and allocation pool is NOT set
2026-10-05 05:51:03,824 - DEBUG - (True, 'PING 169.254.0.7 (169.254.0.7) 56(84) bytes of data.\r\n64 bytes from 169.254.0.7: icmp_seq=1 ttl=63 time=11.2 ms\r\n64 bytes from 169.254.0.7: icmp_seq=2 ttl=63 time=4.44 ms\r\n\r\n--- 169.254.0.7 ping statistics ---\r\n2 packets transmitted, 2 received, 0% packet loss, time 1001ms\r\nrtt min/avg/max/mdev = 4.438/7.840/11.242/3.402 ms')
2026-10-05 05:51:03,825 - INFO - Ping to Metadata IP 169.254.0.7 of VM ctest-FatFlowAggrIpv6Serial-78426072-99604538 passed
2026-10-05 05:51:03,905 - DEBUG - verify_vm_launched is skipped since self.vm_launch_flag is set
2026-10-05 05:51:03,905 - DEBUG - Waiting to SSH to VM ctest-FatFlowAggrIpv6Serial-78426072-99604538, IP 90.218.6.3, Port 22
2026-10-05 05:51:03,973 - DEBUG - Error on ssh to ubuntu@169.254.0.7:22, result: /bin/bash: connect: Connection refused
/bin/bash: line 1: /dev/tcp/169.254.0.7/22: Connection refused {'failed': True, 'command': '(echo > /dev/tcp/169.254.0.7/22)', 'real_command': '/bin/bash -l -c "(echo > /dev/tcp/169.254.0.7/22)"', 'return_code': 1, 'succeeded': False, 'stderr': ''}
2026-10-05 05:51:04,085 - DEBUG - VM ctest-FatFlowAggrIpv6Serial-78426072-99604538 is NOT ready for SSH connections, VM status: ACTIVE
2026-10-05 05:51:09,085 - DEBUG - verify_vm_launched is skipped since self.vm_launch_flag is set
2026-10-05 05:51:09,086 - DEBUG - Waiting to SSH to VM ctest-FatFlowAggrIpv6Serial-78426072-99604538, IP 90.218.6.3, Port 22
2026-10-05 05:51:09,164 - DEBUG - Error on ssh to ubuntu@169.254.0.7:22, result: /bin/bash: connect: Connection refused
/bin/bash: line 1: /dev/tcp/169.254.0.7/22: Connection refused {'failed': True, 'command': '(echo > /dev/tcp/169.254.0.7/22)', 'real_command': '/bin/bash -l -c "(echo > /dev/tcp/169.254.0.7/22)"', 'return_code': 1, 'succeeded': False, 'stderr': ''}
2026-10-05 05:51:09,267 - DEBUG - VM ctest-FatFlowAggrIpv6Serial-78426072-99604538 is NOT ready for SSH connections, VM status: ACTIVE
2026-10-05 05:51:14,268 - DEBUG - verify_vm_launched is skipped since self.vm_launch_flag is set
2026-10-05 05:51:14,268 - DEBUG - Waiting to SSH to VM ctest-FatFlowAggrIpv6Serial-78426072-99604538, IP 90.218.6.3, Port 22
2026-10-05 05:51:14,337 - DEBUG - Error on ssh to ubuntu@169.254.0.7:22, result: /bin/bash: connect: Connection refused
/bin/bash: line 1: /dev/tcp/169.254.0.7/22: Connection refused {'failed': True, 'command': '(echo > /dev/tcp/169.254.0.7/22)', 'real_command': '/bin/bash -l -c "(echo > /dev/tcp/169.254.0.7/22)"', 'return_code': 1, 'succeeded': False, 'stderr': ''}
2026-10-05 05:51:14,442 - DEBUG - VM ctest-FatFlowAggrIpv6Serial-78426072-99604538 is NOT ready for SSH connections, VM status: ACTIVE
2026-10-05 05:51:19,443 - DEBUG - verify_vm_launched is skipped since self.vm_launch_flag is set
2026-10-05 05:51:19,443 - DEBUG - Waiting to SSH to VM ctest-FatFlowAggrIpv6Serial-78426072-99604538, IP 90.218.6.3, Port 22
2026-10-05 05:51:19,616 - DEBUG - VM ctest-FatFlowAggrIpv6Serial-78426072-99604538 is ready for SSH connections
2026-10-05 05:51:19,819 - DEBUG - VM is in ACTIVE state now
2026-10-05 05:51:20,127 - DEBUG - Requesting: http://10.0.0.190:8082/virtual-machine/9bb735a9-21bb-4703-b618-2234ea09e520
2026-10-05 05:51:20,138 - DEBUG - Requesting: http://10.0.0.190:8082/virtual-machine-interface/52c17612-7ba5-48fd-8bd9-e023aaf2d1e8
2026-10-05 05:51:20,152 - DEBUG - Requesting: http://10.0.0.190:8082/instance-ip/2dfc29fe-0e1e-4bf9-8952-29340023e2e9
2026-10-05 05:51:20,165 - DEBUG - Requesting: http://10.0.0.190:8082/instance-ip/a1436494-ad4a-4909-a276-20ca8328b5b6
2026-10-05 05:51:20,196 - DEBUG - Read virtual machine interface {'fq_name': ['default-domain', 'ctest-FatFlowAggrIpv6Serial-78426072', 'ctest-vmi-99442135']}
2026-10-05 05:51:20,828 - DEBUG - Created port 13a73575-ca26-4112-ad73-597b19afdff8
2026-10-05 05:51:21,817 - INFO - VM ([]) created on node: (an-jenkins-deploy-platform-ansible-os-6343-1), Zone: (nova:an-jenkins-deploy-platform-ansible-os-6343-1)
2026-10-05 05:51:21,817 - INFO - Waiting for VM client2_vm to be up..
2026-10-05 05:51:21,863 - DEBUG - VM is still in BUILD state, Expected: ACTIVE
2026-10-05 05:51:26,984 - DEBUG - VM is still in BUILD state, Expected: ACTIVE
2026-10-05 05:51:32,102 - DEBUG - VM is still in BUILD state, Expected: ACTIVE
2026-10-05 05:51:37,207 - DEBUG - VM is still in BUILD state, Expected: ACTIVE
2026-10-05 05:51:42,307 - DEBUG - VM is still in BUILD state, Expected: ACTIVE
2026-10-05 05:51:47,408 - DEBUG - VM is still in BUILD state, Expected: ACTIVE
2026-10-05 05:51:52,514 - DEBUG - VM is in ACTIVE state now
2026-10-05 05:51:52,514 - INFO - VM name : client2_vm
2026-10-05 05:51:52,612 - DEBUG - VM client2_vm ID is 3c87f405-657e-4f49-a89d-e49f1f8b661f
2026-10-05 05:51:52,612 - DEBUG - VM client2_vm launched on Node an-jenkins-deploy-platform-ansible-os-6343-1
2026-10-05 05:51:52,715 - DEBUG - Requesting: http://10.0.0.190:8082/virtual-machine/3c87f405-657e-4f49-a89d-e49f1f8b661f
2026-10-05 05:51:52,731 - DEBUG - Requesting: http://10.0.0.190:8082/virtual-machine-interface/13a73575-ca26-4112-ad73-597b19afdff8
2026-10-05 05:51:55,934 - DEBUG - (True, 'PING 169.254.0.8 (169.254.0.8) 56(84) bytes of data.\r\n\r\n--- 169.254.0.8 ping statistics ---\r\n2 packets transmitted, 0 received, 100% packet loss, time 1024ms')
2026-10-05 05:51:55,935 - DEBUG - Ping to Metadata IP 169.254.0.8 of VM client2_vm failed!
2026-10-05 05:51:55,953 - DEBUG - Gateway for vn default-domain:ctest-FatFlowAggrIpv6Serial-78426072:ctest-vn-41016508 is 90.218.6.1 and allocation pool is NOT set
2026-10-05 05:51:55,954 - DEBUG - Gateway for vn default-domain:ctest-FatFlowAggrIpv6Serial-78426072:ctest-vn-41016508 is 3f71:87a7:6994:3b7:6006:4b2:0:1 and allocation pool is NOT set
2026-10-05 05:52:00,038 - DEBUG - (True, 'PING 169.254.0.8 (169.254.0.8) 56(84) bytes of data.\r\n\r\n--- 169.254.0.8 ping statistics ---\r\n2 packets transmitted, 0 received, 100% packet loss, time 1016ms')
2026-10-05 05:52:00,039 - DEBUG - Ping to Metadata IP 169.254.0.8 of VM client2_vm failed!
2026-10-05 05:52:00,062 - DEBUG - Gateway for vn default-domain:ctest-FatFlowAggrIpv6Serial-78426072:ctest-vn-41016508 is 90.218.6.1 and allocation pool is NOT set
2026-10-05 05:52:00,062 - DEBUG - Gateway for vn default-domain:ctest-FatFlowAggrIpv6Serial-78426072:ctest-vn-41016508 is 3f71:87a7:6994:3b7:6006:4b2:0:1 and allocation pool is NOT set
2026-10-05 05:52:04,125 - DEBUG - (True, 'PING 169.254.0.8 (169.254.0.8) 56(84) bytes of data.\r\n\r\n--- 169.254.0.8 ping statistics ---\r\n2 packets transmitted, 0 received, 100% packet loss, time 1001ms')
2026-10-05 05:52:04,126 - DEBUG - Ping to Metadata IP 169.254.0.8 of VM client2_vm failed!
2026-10-05 05:52:04,144 - DEBUG - Gateway for vn default-domain:ctest-FatFlowAggrIpv6Serial-78426072:ctest-vn-41016508 is 90.218.6.1 and allocation pool is NOT set
2026-10-05 05:52:04,145 - DEBUG - Gateway for vn default-domain:ctest-FatFlowAggrIpv6Serial-78426072:ctest-vn-41016508 is 3f71:87a7:6994:3b7:6006:4b2:0:1 and allocation pool is NOT set
2026-10-05 05:52:08,219 - DEBUG - (True, 'PING 169.254.0.8 (169.254.0.8) 56(84) bytes of data.\r\n\r\n--- 169.254.0.8 ping statistics ---\r\n2 packets transmitted, 0 received, 100% packet loss, time 1014ms')
2026-10-05 05:52:08,220 - DEBUG - Ping to Metadata IP 169.254.0.8 of VM client2_vm failed!
2026-10-05 05:52:08,238 - DEBUG - Gateway for vn default-domain:ctest-FatFlowAggrIpv6Serial-78426072:ctest-vn-41016508 is 90.218.6.1 and allocation pool is NOT set
2026-10-05 05:52:08,238 - DEBUG - Gateway for vn default-domain:ctest-FatFlowAggrIpv6Serial-78426072:ctest-vn-41016508 is 3f71:87a7:6994:3b7:6006:4b2:0:1 and allocation pool is NOT set
2026-10-05 05:52:12,323 - DEBUG - (True, 'PING 169.254.0.8 (169.254.0.8) 56(84) bytes of data.\r\n\r\n--- 169.254.0.8 ping statistics ---\r\n2 packets transmitted, 0 received, 100% packet loss, time 1011ms')
2026-10-05 05:52:12,323 - DEBUG - Ping to Metadata IP 169.254.0.8 of VM client2_vm failed!
2026-10-05 05:52:12,343 - DEBUG - Gateway for vn default-domain:ctest-FatFlowAggrIpv6Serial-78426072:ctest-vn-41016508 is 90.218.6.1 and allocation pool is NOT set
2026-10-05 05:52:12,343 - DEBUG - Gateway for vn default-domain:ctest-FatFlowAggrIpv6Serial-78426072:ctest-vn-41016508 is 3f71:87a7:6994:3b7:6006:4b2:0:1 and allocation pool is NOT set
2026-10-05 05:52:16,421 - DEBUG - (True, 'PING 169.254.0.8 (169.254.0.8) 56(84) bytes of data.\r\n\r\n--- 169.254.0.8 ping statistics ---\r\n2 packets transmitted, 0 received, 100% packet loss, time 1007ms')
2026-10-05 05:52:16,421 - DEBUG - Ping to Metadata IP 169.254.0.8 of VM client2_vm failed!
2026-10-05 05:52:16,442 - DEBUG - Gateway for vn default-domain:ctest-FatFlowAggrIpv6Serial-78426072:ctest-vn-41016508 is 90.218.6.1 and allocation pool is NOT set
2026-10-05 05:52:16,442 - DEBUG - Gateway for vn default-domain:ctest-FatFlowAggrIpv6Serial-78426072:ctest-vn-41016508 is 3f71:87a7:6994:3b7:6006:4b2:0:1 and allocation pool is NOT set
2026-10-05 05:52:20,508 - DEBUG - (True, 'PING 169.254.0.8 (169.254.0.8) 56(84) bytes of data.\r\n\r\n--- 169.254.0.8 ping statistics ---\r\n2 packets transmitted, 0 received, 100% packet loss, time 1003ms')
2026-10-05 05:52:20,508 - DEBUG - Ping to Metadata IP 169.254.0.8 of VM client2_vm failed!
2026-10-05 05:52:20,542 - DEBUG - Gateway for vn default-domain:ctest-FatFlowAggrIpv6Serial-78426072:ctest-vn-41016508 is 90.218.6.1 and allocation pool is NOT set
2026-10-05 05:52:20,542 - DEBUG - Gateway for vn default-domain:ctest-FatFlowAggrIpv6Serial-78426072:ctest-vn-41016508 is 3f71:87a7:6994:3b7:6006:4b2:0:1 and allocation pool is NOT set
2026-10-05 05:52:24,604 - DEBUG - (True, 'PING 169.254.0.8 (169.254.0.8) 56(84) bytes of data.\r\n\r\n--- 169.254.0.8 ping statistics ---\r\n2 packets transmitted, 0 received, 100% packet loss, time 1001ms')
2026-10-05 05:52:24,604 - DEBUG - Ping to Metadata IP 169.254.0.8 of VM client2_vm failed!
2026-10-05 05:52:24,621 - DEBUG - Gateway for vn default-domain:ctest-FatFlowAggrIpv6Serial-78426072:ctest-vn-41016508 is 90.218.6.1 and allocation pool is NOT set
2026-10-05 05:52:24,621 - DEBUG - Gateway for vn default-domain:ctest-FatFlowAggrIpv6Serial-78426072:ctest-vn-41016508 is 3f71:87a7:6994:3b7:6006:4b2:0:1 and allocation pool is NOT set
2026-10-05 05:52:28,704 - DEBUG - (True, 'PING 169.254.0.8 (169.254.0.8) 56(84) bytes of data.\r\n64 bytes from 169.254.0.8: icmp_seq=2 ttl=63 time=8.94 ms\r\n\r\n--- 169.254.0.8 ping statistics ---\r\n2 packets transmitted, 1 received, 50% packet loss, time 1018ms\r\nrtt min/avg/max/mdev = 8.937/8.937/8.937/0.000 ms')
2026-10-05 05:52:28,704 - INFO - Ping to Metadata IP 169.254.0.8 of VM client2_vm passed
2026-10-05 05:52:28,782 - DEBUG - verify_vm_launched is skipped since self.vm_launch_flag is set
2026-10-05 05:52:28,782 - DEBUG - Waiting to SSH to VM client2_vm, IP 90.218.6.11, Port 22
2026-10-05 05:52:28,853 - DEBUG - Error on ssh to ubuntu@169.254.0.8:22, result: /bin/bash: connect: Connection refused
/bin/bash: line 1: /dev/tcp/169.254.0.8/22: Connection refused {'failed': True, 'command': '(echo > /dev/tcp/169.254.0.8/22)', 'real_command': '/bin/bash -l -c "(echo > /dev/tcp/169.254.0.8/22)"', 'return_code': 1, 'succeeded': False, 'stderr': ''}
2026-10-05 05:52:28,970 - DEBUG - VM client2_vm is NOT ready for SSH connections, VM status: ACTIVE
2026-10-05 05:52:33,971 - DEBUG - verify_vm_launched is skipped since self.vm_launch_flag is set
2026-10-05 05:52:33,971 - DEBUG - Waiting to SSH to VM client2_vm, IP 90.218.6.11, Port 22
2026-10-05 05:52:34,044 - DEBUG - Error on ssh to ubuntu@169.254.0.8:22, result: /bin/bash: connect: Connection refused
/bin/bash: line 1: /dev/tcp/169.254.0.8/22: Connection refused {'failed': True, 'command': '(echo > /dev/tcp/169.254.0.8/22)', 'real_command': '/bin/bash -l -c "(echo > /dev/tcp/169.254.0.8/22)"', 'return_code': 1, 'succeeded': False, 'stderr': ''}
2026-10-05 05:52:34,138 - DEBUG - VM client2_vm is NOT ready for SSH connections, VM status: ACTIVE
2026-10-05 05:52:39,139 - DEBUG - verify_vm_launched is skipped since self.vm_launch_flag is set
2026-10-05 05:52:39,139 - DEBUG - Waiting to SSH to VM client2_vm, IP 90.218.6.11, Port 22
2026-10-05 05:52:39,207 - DEBUG - Error on ssh to ubuntu@169.254.0.8:22, result: /bin/bash: connect: Connection refused
/bin/bash: line 1: /dev/tcp/169.254.0.8/22: Connection refused {'failed': True, 'command': '(echo > /dev/tcp/169.254.0.8/22)', 'real_command': '/bin/bash -l -c "(echo > /dev/tcp/169.254.0.8/22)"', 'return_code': 1, 'succeeded': False, 'stderr': ''}
2026-10-05 05:52:39,303 - DEBUG - VM client2_vm is NOT ready for SSH connections, VM status: ACTIVE
2026-10-05 05:52:44,304 - DEBUG - verify_vm_launched is skipped since self.vm_launch_flag is set
2026-10-05 05:52:44,304 - DEBUG - Waiting to SSH to VM client2_vm, IP 90.218.6.11, Port 22
2026-10-05 05:52:44,373 - DEBUG - Error on ssh to ubuntu@169.254.0.8:22, result: /bin/bash: connect: Connection refused
/bin/bash: line 1: /dev/tcp/169.254.0.8/22: Connection refused {'failed': True, 'command': '(echo > /dev/tcp/169.254.0.8/22)', 'real_command': '/bin/bash -l -c "(echo > /dev/tcp/169.254.0.8/22)"', 'return_code': 1, 'succeeded': False, 'stderr': ''}
2026-10-05 05:52:44,471 - DEBUG - VM client2_vm is NOT ready for SSH connections, VM status: ACTIVE
2026-10-05 05:52:49,472 - DEBUG - verify_vm_launched is skipped since self.vm_launch_flag is set
2026-10-05 05:52:49,473 - DEBUG - Waiting to SSH to VM client2_vm, IP 90.218.6.11, Port 22
2026-10-05 05:52:49,540 - DEBUG - Error on ssh to ubuntu@169.254.0.8:22, result: /bin/bash: connect: Connection refused
/bin/bash: line 1: /dev/tcp/169.254.0.8/22: Connection refused {'failed': True, 'command': '(echo > /dev/tcp/169.254.0.8/22)', 'real_command': '/bin/bash -l -c "(echo > /dev/tcp/169.254.0.8/22)"', 'return_code': 1, 'succeeded': False, 'stderr': ''}
2026-10-05 05:52:49,643 - DEBUG - VM client2_vm is NOT ready for SSH connections, VM status: ACTIVE
2026-10-05 05:52:54,644 - DEBUG - verify_vm_launched is skipped since self.vm_launch_flag is set
2026-10-05 05:52:54,644 - DEBUG - Waiting to SSH to VM client2_vm, IP 90.218.6.11, Port 22
2026-10-05 05:52:54,712 - DEBUG - Error on ssh to ubuntu@169.254.0.8:22, result: /bin/bash: connect: Connection refused
/bin/bash: line 1: /dev/tcp/169.254.0.8/22: Connection refused {'failed': True, 'command': '(echo > /dev/tcp/169.254.0.8/22)', 'real_command': '/bin/bash -l -c "(echo > /dev/tcp/169.254.0.8/22)"', 'return_code': 1, 'succeeded': False, 'stderr': ''}
2026-10-05 05:52:54,815 - DEBUG - VM client2_vm is NOT ready for SSH connections, VM status: ACTIVE
2026-10-05 05:52:59,816 - DEBUG - verify_vm_launched is skipped since self.vm_launch_flag is set
2026-10-05 05:52:59,816 - DEBUG - Waiting to SSH to VM client2_vm, IP 90.218.6.11, Port 22
2026-10-05 05:52:59,996 - DEBUG - VM client2_vm is ready for SSH connections
2026-10-05 05:52:59,996 - DEBUG - Hosts: {'nova': ['an-jenkins-deploy-platform-ansible-os-6343-1', 'an-jenkins-deploy-platform-ansible-os-6343-2']}
2026-10-05 05:53:00,868 - INFO - VM ([]) created on node: (an-jenkins-deploy-platform-ansible-os-6343-2), Zone: (nova:an-jenkins-deploy-platform-ansible-os-6343-2)
2026-10-05 05:53:00,868 - INFO - Waiting for VM ctest-FatFlowAggrIpv6Serial-78426072-61459017 to be up..
2026-10-05 05:53:00,920 - DEBUG - VM is still in BUILD state, Expected: ACTIVE
2026-10-05 05:53:05,980 - DEBUG - VM is still in BUILD state, Expected: ACTIVE
2026-10-05 05:53:11,048 - DEBUG - VM is still in BUILD state, Expected: ACTIVE
2026-10-05 05:53:16,121 - DEBUG - VM is still in BUILD state, Expected: ACTIVE
2026-10-05 05:53:21,184 - DEBUG - VM is still in BUILD state, Expected: ACTIVE
2026-10-05 05:53:26,238 - DEBUG - VM is still in BUILD state, Expected: ACTIVE
2026-10-05 05:53:31,298 - DEBUG - VM is still in BUILD state, Expected: ACTIVE
2026-10-05 05:53:36,355 - DEBUG - VM is still in BUILD state, Expected: ACTIVE
2026-10-05 05:53:41,421 - DEBUG - VM is still in BUILD state, Expected: ACTIVE
2026-10-05 05:53:46,476 - DEBUG - VM is still in BUILD state, Expected: ACTIVE
2026-10-05 05:53:51,570 - DEBUG - VM is still in BUILD state, Expected: ACTIVE
2026-10-05 05:53:56,649 - DEBUG - VM is still in BUILD state, Expected: ACTIVE
2026-10-05 05:54:01,708 - DEBUG - VM is still in BUILD state, Expected: ACTIVE
2026-10-05 05:54:06,781 - DEBUG - VM is still in BUILD state, Expected: ACTIVE
2026-10-05 05:54:11,876 - DEBUG - VM is still in BUILD state, Expected: ACTIVE
2026-10-05 05:54:16,935 - DEBUG - VM is still in BUILD state, Expected: ACTIVE
2026-10-05 05:54:22,003 - DEBUG - VM is still in BUILD state, Expected: ACTIVE
2026-10-05 05:54:27,086 - DEBUG - VM is still in BUILD state, Expected: ACTIVE
2026-10-05 05:54:32,146 - DEBUG - VM is still in BUILD state, Expected: ACTIVE
2026-10-05 05:54:37,204 - DEBUG - VM is still in BUILD state, Expected: ACTIVE
2026-10-05 05:54:42,264 - DEBUG - VM is still in BUILD state, Expected: ACTIVE
2026-10-05 05:54:47,324 - DEBUG - VM is still in BUILD state, Expected: ACTIVE
2026-10-05 05:54:52,441 - DEBUG - VM is still in BUILD state, Expected: ACTIVE
2026-10-05 05:54:57,532 - DEBUG - VM is still in BUILD state, Expected: ACTIVE
2026-10-05 05:55:02,631 - DEBUG - VM is still in BUILD state, Expected: ACTIVE
2026-10-05 05:55:07,690 - DEBUG - VM is still in BUILD state, Expected: ACTIVE
2026-10-05 05:55:12,758 - DEBUG - VM is still in BUILD state, Expected: ACTIVE
2026-10-05 05:55:17,822 - DEBUG - VM is still in BUILD state, Expected: ACTIVE
2026-10-05 05:55:22,884 - DEBUG - VM is still in BUILD state, Expected: ACTIVE
2026-10-05 05:55:27,953 - DEBUG - VM is still in BUILD state, Expected: ACTIVE
2026-10-05 05:55:33,015 - DEBUG - VM is still in BUILD state, Expected: ACTIVE
2026-10-05 05:55:33,015 - ERROR - VM is not in ACTIVE state
2026-10-05 05:55:33,123 - ERROR - Fatal Nova Exception while getting VM detail
2026-10-05 05:55:33,123 - DEBUG - None
2026-10-05 05:55:33,129 - INFO - Skip interface_detach for VM ctest-FatFlowAggrIpv6Serial-78426072-61459017 in state BUILD
2026-10-05 05:55:33,129 - INFO - Deleting VM ctest-FatFlowAggrIpv6Serial-78426072-61459017
2026-10-05 05:55:33,129 - ERROR - VM ctest-FatFlowAggrIpv6Serial-78426072-61459017 has failed to come up
2026-10-05 05:55:33,129 - ERROR - Nova failed to get host of the VM
2026-10-05 05:55:33,129 - ERROR - VM ctest-FatFlowAggrIpv6Serial-78426072-61459017 has failed to come up
2026-10-05 05:55:33,129 - ERROR - Nova failed to get host of the VM
2026-10-05 05:55:33,321 - INFO - Detaching port 13a73575-ca26-4112-ad73-597b19afdff8 from VM client2_vm
2026-10-05 05:55:33,365 - INFO - Deleting VM client2_vm
2026-10-05 05:55:33,756 - INFO - Deleted port 13a73575-ca26-4112-ad73-597b19afdff8
2026-10-05 05:55:33,756 - INFO - Deleting VM ctest-FatFlowAggrIpv6Serial-78426072-99604538
2026-10-05 05:55:33,846 - INFO - Deleting VN ctest-vn-03532694
2026-10-05 05:55:34,067 - DEBUG - Response for deleting network ()
2026-10-05 05:55:34,067 - DEBUG - Requesting: http://10.0.0.177:8082/routing-instance/7c4e4996-6828-4976-91ea-8fb9744a8240
2026-10-05 05:55:34,131 - DEBUG - Response Code: 404
2026-10-05 05:55:34,131 - DEBUG - Requesting: http://10.0.0.177:8082/domains
2026-10-05 05:55:34,140 - DEBUG - Requesting: http://10.0.0.177:8082/domain/6850e378-7089-4036-8f54-55c0ed1b9054
2026-10-05 05:55:34,161 - DEBUG - Requesting: http://10.0.0.177:8082/project/ec5f53ec-79ea-49a4-af89-19455039fc06
2026-10-05 05:55:34,313 - INFO - Validated that VN ctest-vn-03532694 is not found in API Server
2026-10-05 05:55:34,327 - DEBUG - VN ctest-vn-03532694 is not present in Agent 10.0.0.50
2026-10-05 05:55:34,340 - DEBUG - VN ctest-vn-03532694 is not present in Agent 10.0.0.191
2026-10-05 05:55:34,341 - INFO - Validated that VN ctest-vn-03532694 is not in any agent
2026-10-05 05:55:34,387 - INFO - Validated that Routing instances and Config db in Control-nodes does not have VN ctest-vn-03532694 info
2026-10-05 05:55:34,387 - INFO - Deleting VN ctest-vn-41016508
2026-10-05 05:55:34,440 - DEBUG - VN 63769265-bec8-430b-ac72-e69892a12ed5 still in use: Unable to complete operation on network 63769265-bec8-430b-ac72-e69892a12ed5. There are one or more ports still in use on the network.
Neutron server returns request_ids: ['req-5c9b235d-bdff-4658-9f53-f5d130e5a675']
2026-10-05 05:55:34,440 - WARNING - Deleting VN ctest-vn-41016508 failed..Will retry
2026-10-05 05:55:36,486 - DEBUG - VN 63769265-bec8-430b-ac72-e69892a12ed5 still in use: Unable to complete operation on network 63769265-bec8-430b-ac72-e69892a12ed5. There are one or more ports still in use on the network.
Neutron server returns request_ids: ['req-c7ddfc4c-860e-4fa1-87e7-a7812c25e65b']
2026-10-05 05:55:36,487 - WARNING - Deleting VN ctest-vn-41016508 failed..Will retry
2026-10-05 05:55:38,872 - DEBUG - Response for deleting network ()
2026-10-05 05:55:38,872 - DEBUG - Requesting: http://10.0.0.177:8082/routing-instance/828ee64d-d4e7-407c-8030-db9e89383e48
2026-10-05 05:55:38,882 - DEBUG - Response Code: 404
2026-10-05 05:55:38,882 - DEBUG - Requesting: http://10.0.0.177:8082/domains
2026-10-05 05:55:38,891 - DEBUG - Requesting: http://10.0.0.177:8082/domain/6850e378-7089-4036-8f54-55c0ed1b9054
2026-10-05 05:55:38,906 - DEBUG - Requesting: http://10.0.0.177:8082/project/ec5f53ec-79ea-49a4-af89-19455039fc06
2026-10-05 05:55:39,023 - INFO - Validated that VN ctest-vn-41016508 is not found in API Server
2026-10-05 05:55:39,037 - DEBUG - VN ctest-vn-41016508 is not present in Agent 10.0.0.50
2026-10-05 05:55:39,050 - DEBUG - VN ctest-vn-41016508 is not present in Agent 10.0.0.191
2026-10-05 05:55:39,050 - INFO - Validated that VN ctest-vn-41016508 is not in any agent
2026-10-05 05:55:39,096 - INFO - Validated that Routing instances and Config db in Control-nodes does not have VN ctest-vn-41016508 info
2026-10-05 05:55:40,440 - ERROR - AssertionError
Python 3.9.25: /usr/bin/python3
Mon Oct 5 05:55:33 2026
A problem occurred in a Python script. Here is the sequence of
function calls leading up to the error, in the order they occurred.
/contrail-test/tcutils/wrappers.py in wrapper(self=, *args=(), **kwargs={})
78 log.info('Initial checks done. Running the testcase now')
79 log.info('')
80 result = function(self, *args, **kwargs)
81 if self.inputs.upgrade:
82 pid = os.getpid()
result = None
function =
self =
args = ()
kwargs = {}
/contrail-test/serial_scripts/vrouter/test_fat_flow_aggr_serial.py in test_fat_flow_aggr_dest_udp_inter_vn_inter_node(self=)
56 policy_deny = False
57 vn_policy = True
58 self.fat_flow_with_prefix_aggr(prefix_length=prefix_length,
59 inter_node=inter_node,inter_vn=inter_vn, proto=proto,
60 port=port, vn_policy=vn_policy, policy_deny=policy_deny,
self =
self.fat_flow_with_prefix_aggr = >
prefix_length = 29
inter_node = True
inter_vn = True
proto = 'udp'
port = 55
vn_policy = True
policy_deny = False
dual undefined
ipv6 = True
prefix_length6 = 125
only_v6 = True
/contrail-test/common/vrouter/base.py in fat_flow_with_prefix_aggr(self=, prefix_length=29, prefix_length6=125, inter_node=True, inter_vn=True, dual=True, traffic_recvr=False, unidirectional_traffic=True, ignore_address=None, proto='udp', port=55, portv6=56, svc_chain=False, only_v6=True, af='v4', icmp_error=False, hc=None, vn_policy=True, policy_deny=False, svm_inter_node=False, resources=True, scale=False)
422 node_name=server_compute)
423 for server in self.server_fixtures:
424 assert server.wait_till_vm_is_up()
425
426 server_fixtures = self.server_fixtures
server =
server.wait_till_vm_is_up = >
AssertionError:
__cause__ = None
__class__ =
__context__ = None
__delattr__ =
__dict__ = {}
__dir__ =
__doc__ = 'Assertion failed.'
__eq__ =
__format__ =
__ge__ =
__getattribute__ =
__gt__ =
__hash__ =
__init__ =
__init_subclass__ =
__le__ =
__lt__ =
__ne__ =
__new__ =
__reduce__ =
__reduce_ex__ =
__repr__ =
__setattr__ =
__setstate__ =
__sizeof__ =
__str__ =
__subclasshook__ =
__suppress_context__ = False
__traceback__ =
args = ()
with_traceback =
The above is a description of an error in a Python program. Here is
the original traceback:
Traceback (most recent call last):
File "/contrail-test/tcutils/wrappers.py", line 80, in wrapper
result = function(self, *args, **kwargs)
File "/contrail-test/serial_scripts/vrouter/test_fat_flow_aggr_serial.py", line 58, in test_fat_flow_aggr_dest_udp_inter_vn_inter_node
self.fat_flow_with_prefix_aggr(prefix_length=prefix_length,
File "/contrail-test/common/vrouter/base.py", line 424, in fat_flow_with_prefix_aggr
assert server.wait_till_vm_is_up()
AssertionError
2026-10-05 05:55:40,441 - DEBUG - Skipping xmpp flap check
2026-10-05 05:55:40,441 - INFO -
2026-10-05 05:55:40,441 - INFO - END TEST : test_fat_flow_aggr_dest_udp_inter_vn_inter_node : FAILED[0:05:50]
2026-10-05 05:55:40,442 - INFO - --------------------------------------------------------------------------------
2026-10-05 05:55:41,775 - ERROR - TestFailed
Python 3.9.25: /usr/bin/python3
Mon Oct 5 05:55:40 2026
A problem occurred in a Python script. Here is the sequence of
function calls leading up to the error, in the order they occurred.
/contrail-test/tcutils/wrappers.py in wrapper(self=, *args=(), **kwargs={})
78 log.info('Initial checks done. Running the testcase now')
79 log.info('')
80 result = function(self, *args, **kwargs)
81 if self.inputs.upgrade:
82 pid = os.getpid()
result = None
function =
self =
args = ()
kwargs = {}
/contrail-test/serial_scripts/vrouter/test_fat_flow_aggr_serial.py in test_fat_flow_aggr_dest_udp_inter_vn_inter_node(self=)
91
92 """
93 self.inputs.set_af('dual')
94 super(FatFlowAggrIpv6Serial, self).test_fat_flow_aggr_dest_udp_inter_vn_inter_node()
95
builtinsuper =
global FatFlowAggrIpv6Serial =
self =
).test_fat_flow_aggr_dest_udp_inter_vn_inter_node = >
/contrail-test/tcutils/wrappers.py in wrapper(self=, *args=(), **kwargs={})
174 if 'ci_image' in list(os.environ.keys()):
175 os.environ['stop_execution_flag'] = 'set'
176 raise TestFailed("\n ".join(errmsg))
177 elif testskip:
178 log.info('')
global TestFailed =
"\n ".join undefined
errmsg = ['Test failed: AssertionError\nPython 3.9.25: /usr/...ert server.wait_till_vm_is_up()\nAssertionError\n\n\n']
TestFailed: Test failed: AssertionError
Python 3.9.25: /usr/bin/python3
Mon Oct 5 05:55:33 2026
A problem occurred in a Python script. Here is the sequence of
function calls leading up to the error, in the order they occurred.
/contrail-test/tcutils/wrappers.py in wrapper(self=, *args=(), **kwargs={})
78 log.info('Initial checks done. Running the testcase now')
79 log.info('')
80 result = function(self, *args, **kwargs)
81 if self.inputs.upgrade:
82 pid = os.getpid()
result = None
function =
self =
args = ()
kwargs = {}
/contrail-test/serial_scripts/vrouter/test_fat_flow_aggr_serial.py in test_fat_flow_aggr_dest_udp_inter_vn_inter_node(self=)
56 policy_deny = False
57 vn_policy = True
58 self.fat_flow_with_prefix_aggr(prefix_length=prefix_length,
59 inter_node=inter_node,inter_vn=inter_vn, proto=proto,
60 port=port, vn_policy=vn_policy, policy_deny=policy_deny,
self =
self.fat_flow_with_prefix_aggr = >
prefix_length = 29
inter_node = True
inter_vn = True
proto = 'udp'
port = 55
vn_policy = True
policy_deny = False
dual undefined
ipv6 = True
prefix_length6 = 125
only_v6 = True
/contrail-test/common/vrouter/base.py in fat_flow_with_prefix_aggr(self=, prefix_length=29, prefix_length6=125, inter_node=True, inter_vn=True, dual=True, traffic_recvr=False, unidirectional_traffic=True, ignore_address=None, proto='udp', port=55, portv6=56, svc_chain=False, only_v6=True, af='v4', icmp_error=False, hc=None, vn_policy=True, policy_deny=False, svm_inter_node=False, resources=True, scale=False)
422 node_name=server_compute)
423 for server in self.server_fixtures:
424 assert server.wait_till_vm_is_up()
425
426 server_fixtures = self.server_fixtures
server =
server.wait_till_vm_is_up = >
AssertionError:
__cause__ = None
__class__ =
__context__ = None
__delattr__ =
__dict__ = {}
__dir__ =
__doc__ = 'Assertion failed.'
__eq__ =
__format__ =
__ge__ =
__getattribute__ =
__gt__ =
__hash__ =
__init__ =
__init_subclass__ =
__le__ =
__lt__ =
__ne__ =
__new__ =
__reduce__ =
__reduce_ex__ =
__repr__ =
__setattr__ =
__setstate__ =
__sizeof__ =
__str__ =
__subclasshook__ =
__suppress_context__ = False
__traceback__ =
args = ()
with_traceback =
The above is a description of an error in a Python program. Here is
the original traceback:
Traceback (most recent call last):
File "/contrail-test/tcutils/wrappers.py", line 80, in wrapper
result = function(self, *args, **kwargs)
File "/contrail-test/serial_scripts/vrouter/test_fat_flow_aggr_serial.py", line 58, in test_fat_flow_aggr_dest_udp_inter_vn_inter_node
self.fat_flow_with_prefix_aggr(prefix_length=prefix_length,
File "/contrail-test/common/vrouter/base.py", line 424, in fat_flow_with_prefix_aggr
assert server.wait_till_vm_is_up()
AssertionError
__cause__ = None
__class__ =
__context__ = None
__delattr__ =
__dict__ = {}
__dir__ =
__doc__ = None
__eq__ =
__format__ =
__ge__ =
__getattribute__ =
__gt__ =
__hash__ =
__init__ =
__init_subclass__ =
__le__ =
__lt__ =
__module__ = 'tcutils.cores'
__ne__ =
__new__ =
__reduce__ =
__reduce_ex__ =
__repr__ =
__setattr__ =
__setstate__ =
__sizeof__ =
__str__ =
__subclasshook__ =
__suppress_context__ = False
__traceback__ =
__weakref__ = None
args = ('Test failed: AssertionError\nPython 3.9.25: /usr/...ert server.wait_till_vm_is_up()\nAssertionError\n\n\n',)
with_traceback =
The above is a description of an error in a Python program. Here is
the original traceback:
Traceback (most recent call last):
File "/contrail-test/tcutils/wrappers.py", line 80, in wrapper
result = function(self, *args, **kwargs)
File "/contrail-test/serial_scripts/vrouter/test_fat_flow_aggr_serial.py", line 94, in test_fat_flow_aggr_dest_udp_inter_vn_inter_node
super(FatFlowAggrIpv6Serial, self).test_fat_flow_aggr_dest_udp_inter_vn_inter_node()
File "/contrail-test/tcutils/wrappers.py", line 176, in wrapper
raise TestFailed("\n ".join(errmsg))
tcutils.cores.TestFailed: Test failed: AssertionError
Python 3.9.25: /usr/bin/python3
Mon Oct 5 05:55:33 2026
A problem occurred in a Python script. Here is the sequence of
function calls leading up to the error, in the order they occurred.
/contrail-test/tcutils/wrappers.py in wrapper(self=, *args=(), **kwargs={})
78 log.info('Initial checks done. Running the testcase now')
79 log.info('')
80 result = function(self, *args, **kwargs)
81 if self.inputs.upgrade:
82 pid = os.getpid()
result = None
function =
self =
args = ()
kwargs = {}
/contrail-test/serial_scripts/vrouter/test_fat_flow_aggr_serial.py in test_fat_flow_aggr_dest_udp_inter_vn_inter_node(self=)
56 policy_deny = False
57 vn_policy = True
58 self.fat_flow_with_prefix_aggr(prefix_length=prefix_length,
59 inter_node=inter_node,inter_vn=inter_vn, proto=proto,
60 port=port, vn_policy=vn_policy, policy_deny=policy_deny,
self =
self.fat_flow_with_prefix_aggr = >
prefix_length = 29
inter_node = True
inter_vn = True
proto = 'udp'
port = 55
vn_policy = True
policy_deny = False
dual undefined
ipv6 = True
prefix_length6 = 125
only_v6 = True
/contrail-test/common/vrouter/base.py in fat_flow_with_prefix_aggr(self=, prefix_length=29, prefix_length6=125, inter_node=True, inter_vn=True, dual=True, traffic_recvr=False, unidirectional_traffic=True, ignore_address=None, proto='udp', port=55, portv6=56, svc_chain=False, only_v6=True, af='v4', icmp_error=False, hc=None, vn_policy=True, policy_deny=False, svm_inter_node=False, resources=True, scale=False)
422 node_name=server_compute)
423 for server in self.server_fixtures:
424 assert server.wait_till_vm_is_up()
425
426 server_fixtures = self.server_fixtures
server =
server.wait_till_vm_is_up = >
AssertionError:
__cause__ = None
__class__ =
__context__ = None
__delattr__ =
__dict__ = {}
__dir__ =
__doc__ = 'Assertion failed.'
__eq__ =
__format__ =
__ge__ =
__getattribute__ =
__gt__ =
__hash__ =
__init__ =
__init_subclass__ =
__le__ =
__lt__ =
__ne__ =
__new__ =
__reduce__ =
__reduce_ex__ =
__repr__ =
__setattr__ =
__setstate__ =
__sizeof__ =
__str__ =
__subclasshook__ =
__suppress_context__ = False
__traceback__ =
args = ()
with_traceback =
The above is a description of an error in a Python program. Here is
the original traceback:
Traceback (most recent call last):
File "/contrail-test/tcutils/wrappers.py", line 80, in wrapper
result = function(self, *args, **kwargs)
File "/contrail-test/serial_scripts/vrouter/test_fat_flow_aggr_serial.py", line 58, in test_fat_flow_aggr_dest_udp_inter_vn_inter_node
self.fat_flow_with_prefix_aggr(prefix_length=prefix_length,
File "/contrail-test/common/vrouter/base.py", line 424, in fat_flow_with_prefix_aggr
assert server.wait_till_vm_is_up()
AssertionError
2026-10-05 05:55:41,777 - DEBUG - Skipping xmpp flap check
2026-10-05 05:55:41,777 - INFO -
2026-10-05 05:55:41,777 - INFO - END TEST : test_fat_flow_aggr_dest_udp_inter_vn_inter_node : FAILED[0:05:53]
2026-10-05 05:55:41,777 - INFO - --------------------------------------------------------------------------------
2026-10-05 05:55:42,775 - INFO - Deleted project: ctest-FatFlowAggrIpv6Serial-78426072, ID : ec5f53ec-79ea-49a4-af89-19455039fc06