| Name | Status | Type | Time(s) | LogFile |
| test_basic_RR[sanity] | Skipped | Skipping Test. Env variable MX_GW_TEST is not set. Skipping the test | 1.560 | |
| test_create_vm_after_RR_set[sanity] | Skipped | Skipping Test. Env variable MX_GW_TEST is not set. Skipping the test | 1.376 | |
| test_contrail_status[cb_sanity,ci_sanity,dev_sanity_dpdk,sanity] | Success | | 2.056 | |
| test_db_nodemgr_status[dev_sanity_dpdk,sanity] | Success | | 1.999 | |
| test_verify_generator_collector_connections[dev_sanity_dpdk,sanity] | Success | | 4.035 | |
| test_verify_generator_connections_to_collector_node[dev_sanity_dpdk,sanity] | Success | | 2.325 | |
| test_verify_process_status_agent[cb_sanity,dev_sanity_dpdk,sanity] | Success | | 1.410 | |
| test_verify_process_status_analytics_node[cb_sanity,dev_sanity_dpdk,sanity] | Success | | 1.861 | |
| test_verify_process_status_control_node[cb_sanity,dev_sanity_dpdk,sanity] | Success | | 1.527 | |
| test_verify_object_logs[ci_sanity,dev_sanity_dpdk,sanity,suite1] | Success | | 50.072 | |
| test_db_manage[cb_sanity,ci_sanity,dev_sanity_dpdk,sanity] | Success | | 7.709 | |
| test_analytics_docs[cb_sanity,ci_sanity,dev_sanity_dpdk,sanity] | Success | | 1.377 | |
| test_config_docs[cb_sanity,ci_sanity,dev_sanity_dpdk,sanity] | Success | | 1.345 | |
| test_ecmp_hash_src_ip[sanity] | Skipped | Skipped as test requires at least 3 nodes, but only 2 found | 1.366 | |
| test_ecmp_svc_v2_in_network_nat_with_3_instance[cb_sanity,sanity] | Skipped | Skipped as test requires at least 3 nodes, but only 2 found | 1.404 | |
| test_ecmp_svc_in_network_with_static_route_no_policy[sanity] | Skipped | image /contrail-test/images/tinycore-in-network.qcow2 is not found | 2.207 | |
| test_ecmp_svc_v2_transparent_with_3_instance[cb_sanity,sanity] | Skipped | Skipped as test requires at least 3 nodes, but only 2 found | 1.446 | |
| test_ecmp_svc_in_network_with_static_route_no_policy[sanity] | Skipped | image /contrail-test/images/tinycore-in-network.qcow2 is not found | 2.112 | |
| test_ecmp_svc_v2_transparent_with_3_instance[cb_sanity,sanity] | Skipped | Skipped as test requires at least 3 nodes, but only 2 found | 1.387 | |
| test_ecmp_svc_in_network_with_3_instance[cb_sanity,sanity] | Skipped | Skipped as test requires at least 3 nodes, but only 2 found | 1.371 | |
| test_ecmp_with_svm_deletion[sanity] | Skipped | Skipped as test requires at least 3 nodes, but only 2 found | 1.371 | |
| test_svc_fate_sharing_basic[sanity] | Skipped | image /contrail-test/images/tinycore-in-network.qcow2 is not found | 2.149 | |
| test_three_stage_v2_SC[sanity] | Skipped | Skipped as test requires at least 3 nodes, but only 2 found | 1.436 | |
| test_svc_fate_sharing_basic[sanity] | Skipped | image /contrail-test/images/tinycore-in-network.qcow2 is not found | 3.511 | |
| test_floating_ip[cb_sanity,ci_contrail_go_kolla_ocata_sanity,ci_sanity,quick_sanity,sanity,suite1,vrouter_gw] | Success | | 181.567 | |
| test_mx_gateway[mx_test,sanity] | Skipped | Skipping Test. Env variable MX_GW_TEST is not set | 2.617 | |
| test_public_access_thru_svc_w_fip[cb_sanity,sanity] | Skipped | Skipped as test requires at least 3 nodes, but only 2 found | 2.697 | |
| test_transit_vn_sym_1_innet[sanity] | Skipped | Skipped as test requires at least 3 nodes, but only 2 found | 2.642 | |
| test_public_access_thru_svc_w_fip[cb_sanity,sanity] | Skipped | Skipped as v6 not supported for this test | 2.682 | |
| test_svc_creation_with_heat[dev_sanity_dpdk,sanity,suite1] | Skipped | Skipped as test requires at least 3 nodes, but only 2 found | 2.688 | |
| test_svc_creation_with_heat[sanity] | Skipped | Skipped as test requires at least 3 nodes, but only 2 found | 2.668 | |
| test_network_tags_crud[ci_sanity,sanity] | Success | | 9.292 | |
| test_router_crud[ci_sanity,dev_sanity_dpdk,sanity] | Success | | 10.417 | |
| test_ports_bindings[ci_sanity,dev_sanity_dpdk,sanity] | Success | | 5.108 | |
| test_ports_specific_subnet_ip[ci_sanity,dev_sanity_dpdk,sanity] | Success | | 45.459 | |
| test_basic_router_behavior[ci_sanity,dev_sanity_dpdk,sanity] | Success | | 68.038 | |
| test_basic_snat_behavior_without_external_connectivity[ci_sanity,dev_sanity_dpdk,sanity,suite1] | Success | | 53.095 | |
| test_basic_policy_allow_deny[cb_sanity,ci_contrail_go_kolla_ocata_sanity,ci_sanity,quick_sanity,sanity,suite1] | Success | | 183.190 | |
| test_policy[quick_sanity,sanity] | Success | | 248.984 | |
| test_policy_to_deny[quick_sanity,sanity] | Success | | 108.701 | |
| test_policy_modify_vn_policy[sanity] | Success | | 121.301 | |
| test_remove_policy_with_ref[ci_sanity,sanity] | Success | | 10.568 | |
| test_policy_inheritance_src_vn_dst_pol[cb_sanity,sanity,vrouter_gw] | Success | | 251.508 | |
| test_policy_inheritance_src_pol_dst_any[sanity] | Success | | 206.731 | |
| test_basic_policy_allow_deny[cb_sanity,ci_contrail_go_kolla_ocata_sanity,ci_sanity,quick_sanity,sanity,suite1] | Success | | 101.499 | |
| test_repeated_policy_modify[sanity] | Success | | 192.482 | |
| test_multi_vn_repeated_policy_update_with_ping[sanity] | Success | | 264.966 | |
| test_multi_vn_repeated_policy_update_with_ping[sanity] | Success | | 233.037 | |
| setUpClass (scripts.qos.test_qos.TestQos) | Failure | Details
Traceback (most recent call last):
testtools.testresult.real._StringException: Traceback (most recent call last):
File "/contrail-test/scripts/qos/test_qos.py", line 13, in setUpClass
super(TestQos, cls).setUpClass()
File "/contrail-test/common/qos/base.py", line 1187, in setUpClass
cls.check_vms_booted([cls.vn1_vm1_fixture, cls.vn1_vm2_fixture,
File "/contrail-test/common/base.py", line 722, in check_vms_booted
assert False, 'One or more vm-boots failed. Check logs'
AssertionError: One or more vm-boots failed. Check logs
| 0.000 |
Log File
|
| test_rp_interface[ci_sanity,sanity] | Failure | Details
Traceback (most recent call last):
testtools.testresult.real._StringException: Traceback (most recent call last):
File "/contrail-test/tcutils/wrappers.py", line 176, in wrapper
raise TestFailed("\n ".join(errmsg))
tcutils.cores.TestFailed: Test failed: AssertionError
Python 3.9.25: /usr/bin/python3
Mon Oct 5 03:41:30 2026
A problem occurred in a Python script. Here is the sequence of
function calls leading up to the error, in the order they occurred.
/contrail-test/tcutils/wrappers.py in wrapper(self=<scripts.routing_policy.test_routing_policy.Test...rp_interface[ci_sanity,sanity] id=0x7efe21556760>, *args=(), **kwargs={})
78 log.info('Initial checks done. Running the testcase now')
79 log.info('')
80 result = function(self, *args, **kwargs)
81 if self.inputs.upgrade:
82 pid = os.getpid()
result = None
function = <function TestRP.test_rp_interface>
self = <scripts.routing_policy.test_routing_policy.Test...rp_interface[ci_sanity,sanity] id=0x7efe21556760>
args = ()
kwargs = {}
/contrail-test/scripts/routing_policy/test_routing_policy.py in test_rp_interface(self=<scripts.routing_policy.test_routing_policy.Test...rp_interface[ci_sanity,sanity] id=0x7efe21556760>)
38 3. Attach policy to VN and confirm if policy takes hold.
39 '''
40 ret_dict = self.config_basic()
41 vn_fixture = ret_dict['vn_fixture']
42 test_vm = ret_dict['test_vm']
ret_dict undefined
self = <scripts.routing_policy.test_routing_policy.Test...rp_interface[ci_sanity,sanity] id=0x7efe21556760>
self.config_basic = <bound method RPBase.config_basic of <scripts.ro...p_interface[ci_sanity,sanity] id=0x7efe21556760>>
/contrail-test/scripts/routing_policy/base.py in config_basic(self=<scripts.routing_policy.test_routing_policy.Test...rp_interface[ci_sanity,sanity] id=0x7efe21556760>)
44 test2_vm = self.create_vm(vn2_fixture, 'test2_vm', image_name='cirros')
45 assert test_vm.wait_till_vm_is_up()
46 assert test2_vm.wait_till_vm_is_up()
47
48 ret_dict = {
test2_vm = <VMFixture: test2_vm>
test2_vm.wait_till_vm_is_up = <bound method VMFixture.wait_till_vm_is_up of <VMFixture: test2_vm>>
AssertionError:
__cause__ = None
__class__ = <class 'AssertionError'>
__context__ = None
__delattr__ = <method-wrapper '__delattr__' of AssertionError object>
__dict__ = {}
__dir__ = <built-in method __dir__ of AssertionError object>
__doc__ = 'Assertion failed.'
__eq__ = <method-wrapper '__eq__' of AssertionError object>
__format__ = <built-in method __format__ of AssertionError object>
__ge__ = <method-wrapper '__ge__' of AssertionError object>
__getattribute__ = <method-wrapper '__getattribute__' of AssertionError object>
__gt__ = <method-wrapper '__gt__' of AssertionError object>
__hash__ = <method-wrapper '__hash__' of AssertionError object>
__init__ = <method-wrapper '__init__' of AssertionError object>
__init_subclass__ = <built-in method __init_subclass__ of type object>
__le__ = <method-wrapper '__le__' of AssertionError object>
__lt__ = <method-wrapper '__lt__' of AssertionError object>
__ne__ = <method-wrapper '__ne__' of AssertionError object>
__new__ = <built-in method __new__ of type object>
__reduce__ = <built-in method __reduce__ of AssertionError object>
__reduce_ex__ = <built-in method __reduce_ex__ of AssertionError object>
__repr__ = <method-wrapper '__repr__' of AssertionError object>
__setattr__ = <method-wrapper '__setattr__' of AssertionError object>
__setstate__ = <built-in method __setstate__ of AssertionError object>
__sizeof__ = <built-in method __sizeof__ of AssertionError object>
__str__ = <method-wrapper '__str__' of AssertionError object>
__subclasshook__ = <built-in method __subclasshook__ of type object>
__suppress_context__ = False
__traceback__ = <traceback object>
args = ()
with_traceback = <built-in method with_traceback of AssertionError object>
The above is a description of an error in a Python program. Here is
the original traceback:
Traceback (most recent call last):
File "/contrail-test/tcutils/wrappers.py", line 80, in wrapper
result = function(self, *args, **kwargs)
File "/contrail-test/scripts/routing_policy/test_routing_policy.py", line 40, in test_rp_interface
ret_dict = self.config_basic()
File "/contrail-test/scripts/routing_policy/base.py", line 46, in config_basic
assert test2_vm.wait_till_vm_is_up()
AssertionError
| 248.956 |
Log File
|
| test_rp_interface_ext_community[sanity] | Failure | Details
Traceback (most recent call last):
testtools.testresult.real._StringException: Traceback (most recent call last):
File "/contrail-test/tcutils/wrappers.py", line 176, in wrapper
raise TestFailed("\n ".join(errmsg))
tcutils.cores.TestFailed: Test failed: AssertionError
Python 3.9.25: /usr/bin/python3
Mon Oct 5 03:45:34 2026
A problem occurred in a Python script. Here is the sequence of
function calls leading up to the error, in the order they occurred.
/contrail-test/tcutils/wrappers.py in wrapper(self=<scripts.routing_policy.test_routing_policy.Test...nterface_ext_community[sanity] id=0x7efe215566a0>, *args=(), **kwargs={})
78 log.info('Initial checks done. Running the testcase now')
79 log.info('')
80 result = function(self, *args, **kwargs)
81 if self.inputs.upgrade:
82 pid = os.getpid()
result = None
function = <function TestRP.test_rp_interface_ext_community>
self = <scripts.routing_policy.test_routing_policy.Test...nterface_ext_community[sanity] id=0x7efe215566a0>
args = ()
kwargs = {}
/contrail-test/scripts/routing_policy/test_routing_policy.py in test_rp_interface_ext_community(self=<scripts.routing_policy.test_routing_policy.Test...nterface_ext_community[sanity] id=0x7efe215566a0>)
249 3. Attach policy to VN and confirm if policy takes hold.
250 '''
251 ret_dict = self.config_basic()
252 vn_fixture = ret_dict['vn_fixture']
253 test_vm = ret_dict['test_vm']
ret_dict undefined
self = <scripts.routing_policy.test_routing_policy.Test...nterface_ext_community[sanity] id=0x7efe215566a0>
self.config_basic = <bound method RPBase.config_basic of <scripts.ro...terface_ext_community[sanity] id=0x7efe215566a0>>
/contrail-test/scripts/routing_policy/base.py in config_basic(self=<scripts.routing_policy.test_routing_policy.Test...nterface_ext_community[sanity] id=0x7efe215566a0>)
44 test2_vm = self.create_vm(vn2_fixture, 'test2_vm', image_name='cirros')
45 assert test_vm.wait_till_vm_is_up()
46 assert test2_vm.wait_till_vm_is_up()
47
48 ret_dict = {
test2_vm = <VMFixture: test2_vm>
test2_vm.wait_till_vm_is_up = <bound method VMFixture.wait_till_vm_is_up of <VMFixture: test2_vm>>
AssertionError:
__cause__ = None
__class__ = <class 'AssertionError'>
__context__ = None
__delattr__ = <method-wrapper '__delattr__' of AssertionError object>
__dict__ = {}
__dir__ = <built-in method __dir__ of AssertionError object>
__doc__ = 'Assertion failed.'
__eq__ = <method-wrapper '__eq__' of AssertionError object>
__format__ = <built-in method __format__ of AssertionError object>
__ge__ = <method-wrapper '__ge__' of AssertionError object>
__getattribute__ = <method-wrapper '__getattribute__' of AssertionError object>
__gt__ = <method-wrapper '__gt__' of AssertionError object>
__hash__ = <method-wrapper '__hash__' of AssertionError object>
__init__ = <method-wrapper '__init__' of AssertionError object>
__init_subclass__ = <built-in method __init_subclass__ of type object>
__le__ = <method-wrapper '__le__' of AssertionError object>
__lt__ = <method-wrapper '__lt__' of AssertionError object>
__ne__ = <method-wrapper '__ne__' of AssertionError object>
__new__ = <built-in method __new__ of type object>
__reduce__ = <built-in method __reduce__ of AssertionError object>
__reduce_ex__ = <built-in method __reduce_ex__ of AssertionError object>
__repr__ = <method-wrapper '__repr__' of AssertionError object>
__setattr__ = <method-wrapper '__setattr__' of AssertionError object>
__setstate__ = <built-in method __setstate__ of AssertionError object>
__sizeof__ = <built-in method __sizeof__ of AssertionError object>
__str__ = <method-wrapper '__str__' of AssertionError object>
__subclasshook__ = <built-in method __subclasshook__ of type object>
__suppress_context__ = False
__traceback__ = <traceback object>
args = ()
with_traceback = <built-in method with_traceback of AssertionError object>
The above is a description of an error in a Python program. Here is
the original traceback:
Traceback (most recent call last):
File "/contrail-test/tcutils/wrappers.py", line 80, in wrapper
result = function(self, *args, **kwargs)
File "/contrail-test/scripts/routing_policy/test_routing_policy.py", line 251, in test_rp_interface_ext_community
ret_dict = self.config_basic()
File "/contrail-test/scripts/routing_policy/base.py", line 46, in config_basic
assert test2_vm.wait_till_vm_is_up()
AssertionError
| 194.580 |
Log File
|
| test_rp_interface_static[sanity] | Failure | Details
Traceback (most recent call last):
testtools.testresult.real._StringException: Traceback (most recent call last):
File "/contrail-test/tcutils/wrappers.py", line 176, in wrapper
raise TestFailed("\n ".join(errmsg))
tcutils.cores.TestFailed: Test failed: AssertionError
Python 3.9.25: /usr/bin/python3
Mon Oct 5 03:46:33 2026
A problem occurred in a Python script. Here is the sequence of
function calls leading up to the error, in the order they occurred.
/contrail-test/tcutils/wrappers.py in wrapper(self=<scripts.routing_policy.test_routing_policy.Test...st_rp_interface_static[sanity] id=0x7efe21556520>, *args=(), **kwargs={})
78 log.info('Initial checks done. Running the testcase now')
79 log.info('')
80 result = function(self, *args, **kwargs)
81 if self.inputs.upgrade:
82 pid = os.getpid()
result = None
function = <function TestRP.test_rp_interface_static>
self = <scripts.routing_policy.test_routing_policy.Test...st_rp_interface_static[sanity] id=0x7efe21556520>
args = ()
kwargs = {}
/contrail-test/scripts/routing_policy/test_routing_policy.py in test_rp_interface_static(self=<scripts.routing_policy.test_routing_policy.Test...st_rp_interface_static[sanity] id=0x7efe21556520>)
56 '''
57
58 ret_dict,random_cidr = self.create_interface_static_routes()
59 config_dicts = {'vn_fixture':ret_dict['vn_fixture'], 'from_term':'protocol', 'sub_from':'interface-static', 'to_term':'community', 'sub_to':'64512:55555'}
60 rp = self.configure_term_routing_policy(config_dicts)
ret_dict undefined
random_cidr undefined
self = <scripts.routing_policy.test_routing_policy.Test...st_rp_interface_static[sanity] id=0x7efe21556520>
self.create_interface_static_routes = <bound method TestRP.create_interface_static_rou...t_rp_interface_static[sanity] id=0x7efe21556520>>
/contrail-test/scripts/routing_policy/test_routing_policy.py in create_interface_static_routes(self=<scripts.routing_policy.test_routing_policy.Test...st_rp_interface_static[sanity] id=0x7efe21556520>)
576
577 def create_interface_static_routes(self):
578 ret_dict = self.config_basic()
579 self.static_table_handle = ContrailVncApi(self.vnc_lib, self.logger)
580 random_cidr = get_random_cidr()
ret_dict undefined
self = <scripts.routing_policy.test_routing_policy.Test...st_rp_interface_static[sanity] id=0x7efe21556520>
self.config_basic = <bound method RPBase.config_basic of <scripts.ro...t_rp_interface_static[sanity] id=0x7efe21556520>>
/contrail-test/scripts/routing_policy/base.py in config_basic(self=<scripts.routing_policy.test_routing_policy.Test...st_rp_interface_static[sanity] id=0x7efe21556520>)
43 image_name='cirros')
44 test2_vm = self.create_vm(vn2_fixture, 'test2_vm', image_name='cirros')
45 assert test_vm.wait_till_vm_is_up()
46 assert test2_vm.wait_till_vm_is_up()
47
test_vm = <VMFixture: test_vm>
test_vm.wait_till_vm_is_up = <bound method VMFixture.wait_till_vm_is_up of <VMFixture: test_vm>>
AssertionError:
__cause__ = None
__class__ = <class 'AssertionError'>
__context__ = None
__delattr__ = <method-wrapper '__delattr__' of AssertionError object>
__dict__ = {}
__dir__ = <built-in method __dir__ of AssertionError object>
__doc__ = 'Assertion failed.'
__eq__ = <method-wrapper '__eq__' of AssertionError object>
__format__ = <built-in method __format__ of AssertionError object>
__ge__ = <method-wrapper '__ge__' of AssertionError object>
__getattribute__ = <method-wrapper '__getattribute__' of AssertionError object>
__gt__ = <method-wrapper '__gt__' of AssertionError object>
__hash__ = <method-wrapper '__hash__' of AssertionError object>
__init__ = <method-wrapper '__init__' of AssertionError object>
__init_subclass__ = <built-in method __init_subclass__ of type object>
__le__ = <method-wrapper '__le__' of AssertionError object>
__lt__ = <method-wrapper '__lt__' of AssertionError object>
__ne__ = <method-wrapper '__ne__' of AssertionError object>
__new__ = <built-in method __new__ of type object>
__reduce__ = <built-in method __reduce__ of AssertionError object>
__reduce_ex__ = <built-in method __reduce_ex__ of AssertionError object>
__repr__ = <method-wrapper '__repr__' of AssertionError object>
__setattr__ = <method-wrapper '__setattr__' of AssertionError object>
__setstate__ = <built-in method __setstate__ of AssertionError object>
__sizeof__ = <built-in method __sizeof__ of AssertionError object>
__str__ = <method-wrapper '__str__' of AssertionError object>
__subclasshook__ = <built-in method __subclasshook__ of type object>
__suppress_context__ = False
__traceback__ = <traceback object>
args = ()
with_traceback = <built-in method with_traceback of AssertionError object>
The above is a description of an error in a Python program. Here is
the original traceback:
Traceback (most recent call last):
File "/contrail-test/tcutils/wrappers.py", line 80, in wrapper
result = function(self, *args, **kwargs)
File "/contrail-test/scripts/routing_policy/test_routing_policy.py", line 58, in test_rp_interface_static
ret_dict,random_cidr = self.create_interface_static_routes()
File "/contrail-test/scripts/routing_policy/test_routing_policy.py", line 578, in create_interface_static_routes
ret_dict = self.config_basic()
File "/contrail-test/scripts/routing_policy/base.py", line 45, in config_basic
assert test_vm.wait_till_vm_is_up()
AssertionError
| 57.362 |
Log File
|
| test_rp_secondary_routes[sanity] | Skipped | Needs MX_GW_TEST to be set | 0.003 | |
| test_rt_CEM_22032[cb_sanity,sanity] | Success | | 94.813 | |
| test_user_def_rt_entry[cb_sanity,sanity] | Failure | Details
Traceback (most recent call last):
testtools.testresult.real._StringException: Traceback (most recent call last):
File "/contrail-test/tcutils/wrappers.py", line 176, in wrapper
raise TestFailed("\n ".join(errmsg))
tcutils.cores.TestFailed: Test failed: AssertionError
Python 3.9.25: /usr/bin/python3
Mon Oct 5 03:52:00 2026
A problem occurred in a Python script. Here is the sequence of
function calls leading up to the error, in the order they occurred.
/contrail-test/tcutils/wrappers.py in wrapper(self=<scripts.rt_filter.test_rt_filter.TestBasicRTFil...def_rt_entry[cb_sanity,sanity] id=0x7efe214ef1f0>, *args=(), **kwargs={})
78 log.info('Initial checks done. Running the testcase now')
79 log.info('')
80 result = function(self, *args, **kwargs)
81 if self.inputs.upgrade:
82 pid = os.getpid()
result = None
function = <function TestBasicRTFilter.test_user_def_rt_entry>
self = <scripts.rt_filter.test_rt_filter.TestBasicRTFil...def_rt_entry[cb_sanity,sanity] id=0x7efe214ef1f0>
args = ()
kwargs = {}
/contrail-test/scripts/rt_filter/test_rt_filter.py in test_user_def_rt_entry(self=<scripts.rt_filter.test_rt_filter.TestBasicRTFil...def_rt_entry[cb_sanity,sanity] id=0x7efe214ef1f0>)
84 vm1_fixture = self.create_vm(vn1_fixture, vm_name=vn1_vm1_name,
85 flavor='contrail_flavor_small', image_name='ubuntu-traffic')
86 assert vm1_fixture.wait_till_vm_is_up()
87 ip = vm1_fixture.vm_ip + '/32'
88 active_ctrl_node = self.get_active_control_node(vm1_fixture)
vm1_fixture = <VMFixture: ctest-vm1-96296807>
vm1_fixture.wait_till_vm_is_up = <bound method VMFixture.wait_till_vm_is_up of <VMFixture: ctest-vm1-96296807>>
AssertionError:
__cause__ = None
__class__ = <class 'AssertionError'>
__context__ = None
__delattr__ = <method-wrapper '__delattr__' of AssertionError object>
__dict__ = {}
__dir__ = <built-in method __dir__ of AssertionError object>
__doc__ = 'Assertion failed.'
__eq__ = <method-wrapper '__eq__' of AssertionError object>
__format__ = <built-in method __format__ of AssertionError object>
__ge__ = <method-wrapper '__ge__' of AssertionError object>
__getattribute__ = <method-wrapper '__getattribute__' of AssertionError object>
__gt__ = <method-wrapper '__gt__' of AssertionError object>
__hash__ = <method-wrapper '__hash__' of AssertionError object>
__init__ = <method-wrapper '__init__' of AssertionError object>
__init_subclass__ = <built-in method __init_subclass__ of type object>
__le__ = <method-wrapper '__le__' of AssertionError object>
__lt__ = <method-wrapper '__lt__' of AssertionError object>
__ne__ = <method-wrapper '__ne__' of AssertionError object>
__new__ = <built-in method __new__ of type object>
__reduce__ = <built-in method __reduce__ of AssertionError object>
__reduce_ex__ = <built-in method __reduce_ex__ of AssertionError object>
__repr__ = <method-wrapper '__repr__' of AssertionError object>
__setattr__ = <method-wrapper '__setattr__' of AssertionError object>
__setstate__ = <built-in method __setstate__ of AssertionError object>
__sizeof__ = <built-in method __sizeof__ of AssertionError object>
__str__ = <method-wrapper '__str__' of AssertionError object>
__subclasshook__ = <built-in method __subclasshook__ of type object>
__suppress_context__ = False
__traceback__ = <traceback object>
args = ()
with_traceback = <built-in method with_traceback of AssertionError object>
The above is a description of an error in a Python program. Here is
the original traceback:
Traceback (most recent call last):
File "/contrail-test/tcutils/wrappers.py", line 80, in wrapper
result = function(self, *args, **kwargs)
File "/contrail-test/scripts/rt_filter/test_rt_filter.py", line 86, in test_user_def_rt_entry
assert vm1_fixture.wait_till_vm_is_up()
AssertionError
| 265.139 |
Log File
|
| test_sec_group_basic[sanity,suite1] | Failure | Details
Traceback (most recent call last):
testtools.testresult.real._StringException: Traceback (most recent call last):
File "/contrail-test/scripts/securitygroup/test_regression.py", line 2149, in test_sec_group_basic
super(SecurityGroupBasicRegressionTests1Ipv6, self).test_sec_group_basic()
File "/contrail-test/tcutils/wrappers.py", line 176, in wrapper
raise TestFailed("\n ".join(errmsg))
tcutils.cores.TestFailed: Test failed: AssertionError
Python 3.9.25: /usr/bin/python3
Mon Oct 5 03:59:01 2026
A problem occurred in a Python script. Here is the sequence of
function calls leading up to the error, in the order they occurred.
/contrail-test/tcutils/wrappers.py in wrapper(self=<scripts.securitygroup.test_regression.SecurityG...sec_group_basic[sanity,suite1] id=0x7efe21501340>, *args=(), **kwargs={})
78 log.info('Initial checks done. Running the testcase now')
79 log.info('')
80 result = function(self, *args, **kwargs)
81 if self.inputs.upgrade:
82 pid = os.getpid()
result = None
function = <function SecurityGroupBasicRegressionTests1.test_sec_group_basic>
self = <scripts.securitygroup.test_regression.SecurityG...sec_group_basic[sanity,suite1] id=0x7efe21501340>
args = ()
kwargs = {}
/contrail-test/scripts/securitygroup/test_regression_basic.py in test_sec_group_basic(self=<scripts.securitygroup.test_regression.SecurityG...sec_group_basic[sanity,suite1] id=0x7efe21501340>)
89 assert vm1_fixture.verify_on_setup()
90 assert vm1_fixture.wait_till_vm_is_up()
91 assert vm2_fixture.verify_on_setup()
92 assert vm2_fixture.wait_till_vm_is_up()
93
vm2_fixture = <VMFixture: ctest-SecurityGroupBasicRegressionTests1Ipv6-04442983-39421889>
vm2_fixture.verify_on_setup = <bound method VMFixture.verify_on_setup of <VMFi...roupBasicRegressionTests1Ipv6-04442983-39421889>>
AssertionError:
__cause__ = None
__class__ = <class 'AssertionError'>
__context__ = None
__delattr__ = <method-wrapper '__delattr__' of AssertionError object>
__dict__ = {}
__dir__ = <built-in method __dir__ of AssertionError object>
__doc__ = 'Assertion failed.'
__eq__ = <method-wrapper '__eq__' of AssertionError object>
__format__ = <built-in method __format__ of AssertionError object>
__ge__ = <method-wrapper '__ge__' of AssertionError object>
__getattribute__ = <method-wrapper '__getattribute__' of AssertionError object>
__gt__ = <method-wrapper '__gt__' of AssertionError object>
__hash__ = <method-wrapper '__hash__' of AssertionError object>
__init__ = <method-wrapper '__init__' of AssertionError object>
__init_subclass__ = <built-in method __init_subclass__ of type object>
__le__ = <method-wrapper '__le__' of AssertionError object>
__lt__ = <method-wrapper '__lt__' of AssertionError object>
__ne__ = <method-wrapper '__ne__' of AssertionError object>
__new__ = <built-in method __new__ of type object>
__reduce__ = <built-in method __reduce__ of AssertionError object>
__reduce_ex__ = <built-in method __reduce_ex__ of AssertionError object>
__repr__ = <method-wrapper '__repr__' of AssertionError object>
__setattr__ = <method-wrapper '__setattr__' of AssertionError object>
__setstate__ = <built-in method __setstate__ of AssertionError object>
__sizeof__ = <built-in method __sizeof__ of AssertionError object>
__str__ = <method-wrapper '__str__' of AssertionError object>
__subclasshook__ = <built-in method __subclasshook__ of type object>
__suppress_context__ = False
__traceback__ = <traceback object>
args = ()
with_traceback = <built-in method with_traceback of AssertionError object>
The above is a description of an error in a Python program. Here is
the original traceback:
Traceback (most recent call last):
File "/contrail-test/tcutils/wrappers.py", line 80, in wrapper
result = function(self, *args, **kwargs)
File "/contrail-test/scripts/securitygroup/test_regression_basic.py", line 91, in test_sec_group_basic
assert vm2_fixture.verify_on_setup()
AssertionError
| 263.107 |
Log File
|
| test_sec_group_basic[sanity,suite1] | Failure | Details
Traceback (most recent call last):
testtools.testresult.real._StringException: Traceback (most recent call last):
File "/contrail-test/scripts/securitygroup/test_regression.py", line 2077, in test_sec_group_basic
super(SecurityGroupBasicRegressionTests1_contrail, self).test_sec_group_basic()
File "/contrail-test/tcutils/wrappers.py", line 176, in wrapper
raise TestFailed("\n ".join(errmsg))
tcutils.cores.TestFailed: Test failed: AssertionError
Python 3.9.25: /usr/bin/python3
Mon Oct 5 04:03:12 2026
A problem occurred in a Python script. Here is the sequence of
function calls leading up to the error, in the order they occurred.
/contrail-test/tcutils/wrappers.py in wrapper(self=<scripts.securitygroup.test_regression.SecurityG...sec_group_basic[sanity,suite1] id=0x7efe21501a90>, *args=(), **kwargs={})
78 log.info('Initial checks done. Running the testcase now')
79 log.info('')
80 result = function(self, *args, **kwargs)
81 if self.inputs.upgrade:
82 pid = os.getpid()
result = None
function = <function SecurityGroupBasicRegressionTests1.test_sec_group_basic>
self = <scripts.securitygroup.test_regression.SecurityG...sec_group_basic[sanity,suite1] id=0x7efe21501a90>
args = ()
kwargs = {}
/contrail-test/scripts/securitygroup/test_regression_basic.py in test_sec_group_basic(self=<scripts.securitygroup.test_regression.SecurityG...sec_group_basic[sanity,suite1] id=0x7efe21501a90>)
89 assert vm1_fixture.verify_on_setup()
90 assert vm1_fixture.wait_till_vm_is_up()
91 assert vm2_fixture.verify_on_setup()
92 assert vm2_fixture.wait_till_vm_is_up()
93
vm2_fixture = <VMFixture: ctest-SecurityGroupBasicRegressionTests1_contrail-34544971-39589726>
vm2_fixture.verify_on_setup = <bound method VMFixture.verify_on_setup of <VMFi...asicRegressionTests1_contrail-34544971-39589726>>
AssertionError:
__cause__ = None
__class__ = <class 'AssertionError'>
__context__ = None
__delattr__ = <method-wrapper '__delattr__' of AssertionError object>
__dict__ = {}
__dir__ = <built-in method __dir__ of AssertionError object>
__doc__ = 'Assertion failed.'
__eq__ = <method-wrapper '__eq__' of AssertionError object>
__format__ = <built-in method __format__ of AssertionError object>
__ge__ = <method-wrapper '__ge__' of AssertionError object>
__getattribute__ = <method-wrapper '__getattribute__' of AssertionError object>
__gt__ = <method-wrapper '__gt__' of AssertionError object>
__hash__ = <method-wrapper '__hash__' of AssertionError object>
__init__ = <method-wrapper '__init__' of AssertionError object>
__init_subclass__ = <built-in method __init_subclass__ of type object>
__le__ = <method-wrapper '__le__' of AssertionError object>
__lt__ = <method-wrapper '__lt__' of AssertionError object>
__ne__ = <method-wrapper '__ne__' of AssertionError object>
__new__ = <built-in method __new__ of type object>
__reduce__ = <built-in method __reduce__ of AssertionError object>
__reduce_ex__ = <built-in method __reduce_ex__ of AssertionError object>
__repr__ = <method-wrapper '__repr__' of AssertionError object>
__setattr__ = <method-wrapper '__setattr__' of AssertionError object>
__setstate__ = <built-in method __setstate__ of AssertionError object>
__sizeof__ = <built-in method __sizeof__ of AssertionError object>
__str__ = <method-wrapper '__str__' of AssertionError object>
__subclasshook__ = <built-in method __subclasshook__ of type object>
__suppress_context__ = False
__traceback__ = <traceback object>
args = ()
with_traceback = <built-in method with_traceback of AssertionError object>
The above is a description of an error in a Python program. Here is
the original traceback:
Traceback (most recent call last):
File "/contrail-test/tcutils/wrappers.py", line 80, in wrapper
result = function(self, *args, **kwargs)
File "/contrail-test/scripts/securitygroup/test_regression_basic.py", line 91, in test_sec_group_basic
assert vm2_fixture.verify_on_setup()
AssertionError
| 265.202 |
Log File
|
| test_sec_group_basic[cb_sanity,ci_contrail_go_kolla_ocata_sanity,sanity,suite1] | Failure | Details
Traceback (most recent call last):
testtools.testresult.real._StringException: Traceback (most recent call last):
File "/contrail-test/tcutils/wrappers.py", line 176, in wrapper
raise TestFailed("\n ".join(errmsg))
tcutils.cores.TestFailed: Test failed: AssertionError
Python 3.9.25: /usr/bin/python3
Mon Oct 5 04:07:41 2026
A problem occurred in a Python script. Here is the sequence of
function calls leading up to the error, in the order they occurred.
/contrail-test/tcutils/wrappers.py in wrapper(self=<scripts.securitygroup.test_regression_basic.Sec...la_ocata_sanity,sanity,suite1] id=0x7efe214ba400>, *args=(), **kwargs={})
78 log.info('Initial checks done. Running the testcase now')
79 log.info('')
80 result = function(self, *args, **kwargs)
81 if self.inputs.upgrade:
82 pid = os.getpid()
result = None
function = <function SecurityGroupBasicRegressionTests1.test_sec_group_basic>
self = <scripts.securitygroup.test_regression_basic.Sec...la_ocata_sanity,sanity,suite1] id=0x7efe214ba400>
args = ()
kwargs = {}
/contrail-test/scripts/securitygroup/test_regression_basic.py in test_sec_group_basic(self=<scripts.securitygroup.test_regression_basic.Sec...la_ocata_sanity,sanity,suite1] id=0x7efe214ba400>)
89 assert vm1_fixture.verify_on_setup()
90 assert vm1_fixture.wait_till_vm_is_up()
91 assert vm2_fixture.verify_on_setup()
92 assert vm2_fixture.wait_till_vm_is_up()
93
vm2_fixture = <VMFixture: ctest-SecurityGroupBasicRegressionTests1-37697791-26105840>
vm2_fixture.verify_on_setup = <bound method VMFixture.verify_on_setup of <VMFi...ityGroupBasicRegressionTests1-37697791-26105840>>
AssertionError:
__cause__ = None
__class__ = <class 'AssertionError'>
__context__ = None
__delattr__ = <method-wrapper '__delattr__' of AssertionError object>
__dict__ = {}
__dir__ = <built-in method __dir__ of AssertionError object>
__doc__ = 'Assertion failed.'
__eq__ = <method-wrapper '__eq__' of AssertionError object>
__format__ = <built-in method __format__ of AssertionError object>
__ge__ = <method-wrapper '__ge__' of AssertionError object>
__getattribute__ = <method-wrapper '__getattribute__' of AssertionError object>
__gt__ = <method-wrapper '__gt__' of AssertionError object>
__hash__ = <method-wrapper '__hash__' of AssertionError object>
__init__ = <method-wrapper '__init__' of AssertionError object>
__init_subclass__ = <built-in method __init_subclass__ of type object>
__le__ = <method-wrapper '__le__' of AssertionError object>
__lt__ = <method-wrapper '__lt__' of AssertionError object>
__ne__ = <method-wrapper '__ne__' of AssertionError object>
__new__ = <built-in method __new__ of type object>
__reduce__ = <built-in method __reduce__ of AssertionError object>
__reduce_ex__ = <built-in method __reduce_ex__ of AssertionError object>
__repr__ = <method-wrapper '__repr__' of AssertionError object>
__setattr__ = <method-wrapper '__setattr__' of AssertionError object>
__setstate__ = <built-in method __setstate__ of AssertionError object>
__sizeof__ = <built-in method __sizeof__ of AssertionError object>
__str__ = <method-wrapper '__str__' of AssertionError object>
__subclasshook__ = <built-in method __subclasshook__ of type object>
__suppress_context__ = False
__traceback__ = <traceback object>
args = ()
with_traceback = <built-in method with_traceback of AssertionError object>
The above is a description of an error in a Python program. Here is
the original traceback:
Traceback (most recent call last):
File "/contrail-test/tcutils/wrappers.py", line 80, in wrapper
result = function(self, *args, **kwargs)
File "/contrail-test/scripts/securitygroup/test_regression_basic.py", line 91, in test_sec_group_basic
assert vm2_fixture.verify_on_setup()
AssertionError
| 265.784 |
Log File
|
| test_svc_in_net_nat_with_static_routes[sanity] | Skipped | image /contrail-test/images/tinycore-in-network-nat.qcow2 is not found | 50.216 | |
| test_svc_v2_transparent_datapath[sanity] | Skipped | image /contrail-test/images/tinycore-net-transparent-fw.qcow2 is not found | 13.934 | |
| test_svc_CEM_22032[ci_sanity_WIP,quick_sanity,sanity,suite1] | Skipped | image /contrail-test/images/tinycore-in-network-nat.qcow2 is not found | 12.848 | |
| test_svc_in_network_datapath[ci_sanity_WIP,quick_sanity,sanity,suite1] | Skipped | image /contrail-test/images/tinycore-in-network-nat.qcow2 is not found | 10.156 | |
| test_svc_hc_basic[sanity] | Skipped | image /contrail-test/images/tinycore-in-network-nat.qcow2 is not found | 13.919 | |
| test_svc_trans_segment_right_hc_fail_svm[sanity] | Skipped | image /contrail-test/images/tinycore-net-transparent-fw.qcow2 is not found | 14.328 | |
| test_svc_v2_mirroring[ci_sanity_WIP,quick_sanity,sanity] | Failure | Details
Traceback (most recent call last):
testtools.testresult.real._StringException: Traceback (most recent call last):
File "/contrail-test/tcutils/wrappers.py", line 176, in wrapper
raise TestFailed("\n ".join(errmsg))
tcutils.cores.TestFailed: Test failed: AssertionError
Python 3.9.25: /usr/bin/python3
Mon Oct 5 04:14:54 2026
A problem occurred in a Python script. Here is the sequence of
function calls leading up to the error, in the order they occurred.
/contrail-test/tcutils/wrappers.py in wrapper(self=<scripts.svc_mirror.test_mirror.TestSVCV2Mirror....anity_WIP,quick_sanity,sanity] id=0x7efe2147c640>, *args=(), **kwargs={})
78 log.info('Initial checks done. Running the testcase now')
79 log.info('')
80 result = function(self, *args, **kwargs)
81 if self.inputs.upgrade:
82 pid = os.getpid()
result = None
function = <function TestSVCV2Mirror.test_svc_v2_mirroring>
self = <scripts.svc_mirror.test_mirror.TestSVCV2Mirror....anity_WIP,quick_sanity,sanity] id=0x7efe2147c640>
args = ()
kwargs = {}
/contrail-test/scripts/svc_mirror/test_mirror.py in test_svc_v2_mirroring(self=<scripts.svc_mirror.test_mirror.TestSVCV2Mirror....anity_WIP,quick_sanity,sanity] id=0x7efe2147c640>)
22 def test_svc_v2_mirroring(self):
23 """Validate the service chain mirroring"""
24 return self.verify_svc_mirroring()
25
26 @preposttest_wrapper
self = <scripts.svc_mirror.test_mirror.TestSVCV2Mirror....anity_WIP,quick_sanity,sanity] id=0x7efe2147c640>
self.verify_svc_mirroring = <bound method VerifySvcMirror.verify_svc_mirrori...nity_WIP,quick_sanity,sanity] id=0x7efe2147c640>>
/contrail-test/common/servicechain/mirror/verify.py in verify_svc_mirroring(self=<scripts.svc_mirror.test_mirror.TestSVCV2Mirror....anity_WIP,quick_sanity,sanity] id=0x7efe2147c640>, *args=(), **kwargs={})
12
13 def verify_svc_mirroring(self, *args, **kwargs):
14 ret_dict = self.config_svc_mirroring(*args, **kwargs)
15 left_vm_fixture = ret_dict['left_vm_fixture']
16 right_vm_fixture = ret_dict['right_vm_fixture']
ret_dict undefined
self = <scripts.svc_mirror.test_mirror.TestSVCV2Mirror....anity_WIP,quick_sanity,sanity] id=0x7efe2147c640>
self.config_svc_mirroring = <bound method ConfigSvcMirror.config_svc_mirrori...nity_WIP,quick_sanity,sanity] id=0x7efe2147c640>>
args = ()
kwargs = {}
/contrail-test/common/servicechain/mirror/config.py in config_svc_mirroring(self=<scripts.svc_mirror.test_mirror.TestSVCV2Mirror....anity_WIP,quick_sanity,sanity] id=0x7efe2147c640>, service_mode='transparent', *args=(), **kwargs={})
36 vn2_fixture = self.config_vn(vn2_name, vn2_subnets)
37
38 ret_dict = self.verify_svc_chain(service_mode=service_mode,
39 service_type=service_type,
40 left_vn_fixture=vn1_fixture,
ret_dict undefined
self = <scripts.svc_mirror.test_mirror.TestSVCV2Mirror....anity_WIP,quick_sanity,sanity] id=0x7efe2147c640>
self.verify_svc_chain = <bound method VerifySvcChain.verify_svc_chain of...nity_WIP,quick_sanity,sanity] id=0x7efe2147c640>>
service_mode = 'transparent'
service_type = 'analyzer'
left_vn_fixture undefined
vn1_fixture = <vn_test.VNFixture object>
right_vn_fixture undefined
vn2_fixture = <vn_test.VNFixture object>
create_svms = True
kwargs = {}
/contrail-test/common/servicechain/verify.py in verify_svc_chain(self=<scripts.svc_mirror.test_mirror.TestSVCV2Mirror....anity_WIP,quick_sanity,sanity] id=0x7efe2147c640>, *args=(), **kwargs={'create_svms': True, 'left_vn_fixture': <vn_test.VNFixture object>, 'right_vn_fixture': <vn_test.VNFixture object>, 'service_mode': 'transparent', 'service_type': 'analyzer'})
318 def verify_svc_chain(self, *args, **kwargs):
319 svc_chain_info = kwargs.get('svc_chain_info')
320 ret_dict = svc_chain_info or self.config_svc_chain(*args, **kwargs)
321 proto = kwargs.get('proto', 'any')
322 left_vn_fq_name = ret_dict.get('left_vn_fixture').vn_fq_name
ret_dict undefined
svc_chain_info = None
self = <scripts.svc_mirror.test_mirror.TestSVCV2Mirror....anity_WIP,quick_sanity,sanity] id=0x7efe2147c640>
self.config_svc_chain = <bound method ConfigSvcChain.config_svc_chain of...nity_WIP,quick_sanity,sanity] id=0x7efe2147c640>>
args = ()
kwargs = {'create_svms': True, 'left_vn_fixture': <vn_test.VNFixture object>, 'right_vn_fixture': <vn_test.VNFixture object>, 'service_mode': 'transparent', 'service_type': 'analyzer'}
/contrail-test/common/servicechain/config.py in config_svc_chain(self=<scripts.svc_mirror.test_mirror.TestSVCV2Mirror....anity_WIP,quick_sanity,sanity] id=0x7efe2147c640>, service_mode='transparent', service_type='analyzer', max_inst=1, proto='any', svc_chain_type='parallel', src_ports=[0, 65535], dst_ports=[0, 65535], svc_img_name='ubuntu', st_version=2, mgmt_vn_name='ctest-mgmt_vn-59705736', mgmt_vn_subnets=['150.57.91.128/26'], mgmt_vn_fixture=<vn_test.VNFixture object>, left_vn_name='ctest-left-67658520', left_vn_subnets=['148.11.213.192/26'], left_vn_fixture=<vn_test.VNFixture object>, right_vn_name='ctest-right-03952265', right_vn_subnets=['133.18.128.128/26'], right_vn_fixture=<vn_test.VNFixture object>, left_lr_child_vn_fixture=None, right_lr_child_vn_fixture=None, left_vm_name='ctest-left_vm-33263914', left_vm_fixture=<VMFixture: ctest-left_vm-33263914>, right_vm_name='ctest-right_vm-48504918', right_vm_fixture=<VMFixture: ctest-right_vm-48504918>, image_name='ubuntu-traffic', policy_fixture=None, st_fixture=<svc_template_fixture.SvcTemplateFixture object>, si_fixture=<svc_instance_fixture.SvcInstanceFixture object>, port_tuples_props=None, static_route=None, svm_fixtures=[<VMFixture: ctest-pt_svm0-42955425>], create_svms=True, evpn=False, modify_rules=False, policy_action='pass', hosts=[], **kwargs={})
580 self.verify_vm(left_vm_fixture)
581 if created_right_vm:
582 self.verify_vm(right_vm_fixture)
583
584
self = <scripts.svc_mirror.test_mirror.TestSVCV2Mirror....anity_WIP,quick_sanity,sanity] id=0x7efe2147c640>
self.verify_vm = <bound method ConfigSvcChain.verify_vm of <scrip...nity_WIP,quick_sanity,sanity] id=0x7efe2147c640>>
right_vm_fixture = <VMFixture: ctest-right_vm-48504918>
/contrail-test/common/servicechain/config.py in verify_vm(self=<scripts.svc_mirror.test_mirror.TestSVCV2Mirror....anity_WIP,quick_sanity,sanity] id=0x7efe2147c640>, vm_fixture=<VMFixture: ctest-right_vm-48504918>)
173
174 def verify_vm(self, vm_fixture):
175 assert vm_fixture.wait_till_vm_is_up(), 'VM does not seem to be up'
176 # end verify_vm
177
vm_fixture = <VMFixture: ctest-right_vm-48504918>
vm_fixture.wait_till_vm_is_up = <bound method VMFixture.wait_till_vm_is_up of <VMFixture: ctest-right_vm-48504918>>
AssertionError: VM does not seem to be up
__cause__ = None
__class__ = <class 'AssertionError'>
__context__ = None
__delattr__ = <method-wrapper '__delattr__' of AssertionError object>
__dict__ = {}
__dir__ = <built-in method __dir__ of AssertionError object>
__doc__ = 'Assertion failed.'
__eq__ = <method-wrapper '__eq__' of AssertionError object>
__format__ = <built-in method __format__ of AssertionError object>
__ge__ = <method-wrapper '__ge__' of AssertionError object>
__getattribute__ = <method-wrapper '__getattribute__' of AssertionError object>
__gt__ = <method-wrapper '__gt__' of AssertionError object>
__hash__ = <method-wrapper '__hash__' of AssertionError object>
__init__ = <method-wrapper '__init__' of AssertionError object>
__init_subclass__ = <built-in method __init_subclass__ of type object>
__le__ = <method-wrapper '__le__' of AssertionError object>
__lt__ = <method-wrapper '__lt__' of AssertionError object>
__ne__ = <method-wrapper '__ne__' of AssertionError object>
__new__ = <built-in method __new__ of type object>
__reduce__ = <built-in method __reduce__ of AssertionError object>
__reduce_ex__ = <built-in method __reduce_ex__ of AssertionError object>
__repr__ = <method-wrapper '__repr__' of AssertionError object>
__setattr__ = <method-wrapper '__setattr__' of AssertionError object>
__setstate__ = <built-in method __setstate__ of AssertionError object>
__sizeof__ = <built-in method __sizeof__ of AssertionError object>
__str__ = <method-wrapper '__str__' of AssertionError object>
__subclasshook__ = <built-in method __subclasshook__ of type object>
__suppress_context__ = False
__traceback__ = <traceback object>
args = ('VM does not seem to be up',)
with_traceback = <built-in method with_traceback of AssertionError object>
The above is a description of an error in a Python program. Here is
the original traceback:
Traceback (most recent call last):
File "/contrail-test/tcutils/wrappers.py", line 80, in wrapper
result = function(self, *args, **kwargs)
File "/contrail-test/scripts/svc_mirror/test_mirror.py", line 24, in test_svc_v2_mirroring
return self.verify_svc_mirroring()
File "/contrail-test/common/servicechain/mirror/verify.py", line 14, in verify_svc_mirroring
ret_dict = self.config_svc_mirroring(*args, **kwargs)
File "/contrail-test/common/servicechain/mirror/config.py", line 38, in config_svc_mirroring
ret_dict = self.verify_svc_chain(service_mode=service_mode,
File "/contrail-test/common/servicechain/verify.py", line 320, in verify_svc_chain
ret_dict = svc_chain_info or self.config_svc_chain(*args, **kwargs)
File "/contrail-test/common/servicechain/config.py", line 582, in config_svc_chain
self.verify_vm(right_vm_fixture)
File "/contrail-test/common/servicechain/config.py", line 175, in verify_vm
assert vm_fixture.wait_till_vm_is_up(), 'VM does not seem to be up'
AssertionError: VM does not seem to be up
| 274.969 |
Log File
|
| test_vdns_ping_same_vn[ci_sanity,sanity,suite1] | Failure | Details
Traceback (most recent call last):
testtools.testresult.real._StringException: stderr: {{{Warning: sudo() received nonzero return code 1 while executing 'python -c 'import socket;socket.getaddrinfo("ctest-vm1-test-36217674", None, socket.AF_INET6)''!}}}
stdout: {{{
[ubuntu@169.254.0.3] run: ifconfig | grep 10.10.10.3
[ubuntu@169.254.0.3] run: ifconfig | grep 10.10.10.3
[ubuntu@169.254.0.3] out: inet addr:10.10.10.3 Bcast:10.10.10.255 Mask:255.255.255.0
[ubuntu@169.254.0.3] out:
[ubuntu@169.254.0.3] sudo: python -c 'import socket;socket.getaddrinfo("ctest-vm1-test-36217674", None, socket.AF_INET6)'
[ubuntu@169.254.0.3] out: Traceback (most recent call last):
[ubuntu@169.254.0.3] out: File "<string>", line 1, in <module>
[ubuntu@169.254.0.3] out: socket.gaierror: [Errno -5] No address associated with hostname
[ubuntu@169.254.0.3] out:
[ubuntu@169.254.0.3] sudo: ping -s 56 -c 3 -W 1 ctest-vm1-test-36217674
[ubuntu@169.254.0.3] out: PING ctest-vm1-test-36217674.juniper.net (10.10.10.3) 56(84) bytes of data.
[ubuntu@169.254.0.3] out: 64 bytes from ctest-vm1-test-36217674.juniper.net (10.10.10.3): icmp_req=1 ttl=64 time=2.24 ms
[ubuntu@169.254.0.3] out: 64 bytes from ctest-vm1-test-36217674.juniper.net (10.10.10.3): icmp_req=2 ttl=64 time=0.275 ms
[ubuntu@169.254.0.3] out: 64 bytes from ctest-vm1-test-36217674.juniper.net (10.10.10.3): icmp_req=3 ttl=64 time=0.213 ms
[ubuntu@169.254.0.3] out:
[ubuntu@169.254.0.3] out: --- ctest-vm1-test-36217674.juniper.net ping statistics ---
[ubuntu@169.254.0.3] out: 3 packets transmitted, 3 received, 0% packet loss, time 2004ms
[ubuntu@169.254.0.3] out: rtt min/avg/max/mdev = 0.213/0.911/2.245/0.943 ms
[ubuntu@169.254.0.3] out:
}}}
Traceback (most recent call last):
File "/contrail-test/tcutils/util.py", line 1041, in wrapper
return f(self, *func_args, **func_kwargs)
File "/contrail-test/tcutils/wrappers.py", line 176, in wrapper
raise TestFailed("\n ".join(errmsg))
tcutils.cores.TestFailed: Test failed: AssertionError
Python 3.9.25: /usr/bin/python3
Mon Oct 5 04:19:08 2026
A problem occurred in a Python script. Here is the sequence of
function calls leading up to the error, in the order they occurred.
/contrail-test/tcutils/wrappers.py in wrapper(self=<scripts.vdns.test_vdns_basic.TestvDNSBasic0.tes...me_vn[ci_sanity,sanity,suite1] id=0x7efe214955e0>, *args=(), **kwargs={})
78 log.info('Initial checks done. Running the testcase now')
79 log.info('')
80 result = function(self, *args, **kwargs)
81 if self.inputs.upgrade:
82 pid = os.getpid()
result = None
function = <function TestvDNSBasic0.test_vdns_ping_same_vn>
self = <scripts.vdns.test_vdns_basic.TestvDNSBasic0.tes...me_vn[ci_sanity,sanity,suite1] id=0x7efe214955e0>
args = ()
kwargs = {}
/contrail-test/scripts/vdns/test_vdns_basic.py in test_vdns_ping_same_vn(self=<scripts.vdns.test_vdns_basic.TestvDNSBasic0.tes...me_vn[ci_sanity,sanity,suite1] id=0x7efe214955e0>)
94 vm_fixture[vm_name] = self.useFixture(
95 VMFixture(project_name=self.inputs.project_name, connections=self.connections, vn_obj=vn_quantum_obj, vm_name=vm_name,image_name='ubuntu-traffic'))
96 assert vm_fixture[vm_name].wait_till_vm_is_up(), ('VM %s'
97 ' failed to come up' % (vm_name))
98 vm_ip = vm_fixture[vm_name].get_vm_ip_from_vm(
vm_fixture = {'ctest-vm1-test-36217674': <VMFixture: ctest-vm1-test-36217674>, 'ctest-vm2-test-39419965': <VMFixture: ctest-vm2-test-39419965>}
vm_name = 'ctest-vm2-test-39419965'
].wait_till_vm_is_up undefined
AssertionError: VM ctest-vm2-test-39419965 failed to come up
__cause__ = None
__class__ = <class 'AssertionError'>
__context__ = None
__delattr__ = <method-wrapper '__delattr__' of AssertionError object>
__dict__ = {}
__dir__ = <built-in method __dir__ of AssertionError object>
__doc__ = 'Assertion failed.'
__eq__ = <method-wrapper '__eq__' of AssertionError object>
__format__ = <built-in method __format__ of AssertionError object>
__ge__ = <method-wrapper '__ge__' of AssertionError object>
__getattribute__ = <method-wrapper '__getattribute__' of AssertionError object>
__gt__ = <method-wrapper '__gt__' of AssertionError object>
__hash__ = <method-wrapper '__hash__' of AssertionError object>
__init__ = <method-wrapper '__init__' of AssertionError object>
__init_subclass__ = <built-in method __init_subclass__ of type object>
__le__ = <method-wrapper '__le__' of AssertionError object>
__lt__ = <method-wrapper '__lt__' of AssertionError object>
__ne__ = <method-wrapper '__ne__' of AssertionError object>
__new__ = <built-in method __new__ of type object>
__reduce__ = <built-in method __reduce__ of AssertionError object>
__reduce_ex__ = <built-in method __reduce_ex__ of AssertionError object>
__repr__ = <method-wrapper '__repr__' of AssertionError object>
__setattr__ = <method-wrapper '__setattr__' of AssertionError object>
__setstate__ = <built-in method __setstate__ of AssertionError object>
__sizeof__ = <built-in method __sizeof__ of AssertionError object>
__str__ = <method-wrapper '__str__' of AssertionError object>
__subclasshook__ = <built-in method __subclasshook__ of type object>
__suppress_context__ = False
__traceback__ = <traceback object>
args = ('VM ctest-vm2-test-39419965 failed to come up',)
with_traceback = <built-in method with_traceback of AssertionError object>
The above is a description of an error in a Python program. Here is
the original traceback:
Traceback (most recent call last):
File "/contrail-test/tcutils/wrappers.py", line 80, in wrapper
result = function(self, *args, **kwargs)
File "/contrail-test/scripts/vdns/test_vdns_basic.py", line 96, in test_vdns_ping_same_vn
assert vm_fixture[vm_name].wait_till_vm_is_up(), ('VM %s'
AssertionError: VM ctest-vm2-test-39419965 failed to come up
| 250.024 |
Log File
|
| test_sctp_traffic_between_vm[sanity] | Failure | Details
Traceback (most recent call last):
testtools.testresult.real._StringException: stdout: {{{
[localhost] local: mkdir -p /contrail-test/images
[localhost] local: wget -nv http://nexus.opensdn.io/repository///images/converts//ubuntu-sctp.vmdk.gz -O /contrail-test/images/ubuntu-sctp.vmdk.gz
[localhost] local: gunzip -f /contrail-test/images/ubuntu-sctp.vmdk.gz
[localhost] local: rm -f /contrail-test/images/ubuntu-sctp.vmdk
}}}
Traceback (most recent call last):
File "/contrail-test/tcutils/util.py", line 1041, in wrapper
return f(self, *func_args, **func_kwargs)
File "/contrail-test/tcutils/wrappers.py", line 176, in wrapper
raise TestFailed("\n ".join(errmsg))
tcutils.cores.TestFailed: Test failed: <pre>Traceback (most recent call last):
File "/contrail-test/tcutils/wrappers.py", line 80, in wrapper
result = function(self, *args, **kwargs)
File "/contrail-test/scripts/vm_regression/test_vm.py", line 3030, in test_sctp_traffic_between_vm
if not vn1_vm1_fixture.ping_with_certainty(fvn_vm1_fixture.vm_ip):
File "/contrail-test/fixtures/vm_test.py", line 354, in vm_ip
assert self.verify_vm_launched()
AssertionError
</pre>
| 648.511 |
Log File
|
| test_generic_link_local_service[cb_sanity,ci_contrail_go_kolla_ocata_sanity,ci_sanity,dev_sanity_dpdk,sanity,suite1] | Success | | 45.600 | |
| test_metadata_service[cb_sanity,ci_sanity,sanity,suite1] | Failure | Details
Traceback (most recent call last):
testtools.testresult.real._StringException: Traceback (most recent call last):
File "/contrail-test/tcutils/wrappers.py", line 176, in wrapper
raise TestFailed("\n ".join(errmsg))
tcutils.cores.TestFailed: Test failed: AssertionError
Python 3.9.25: /usr/bin/python3
Mon Oct 5 04:33:32 2026
A problem occurred in a Python script. Here is the sequence of
function calls leading up to the error, in the order they occurred.
/contrail-test/tcutils/wrappers.py in wrapper(self=<scripts.vm_regression.test_vm_basic.TestBasicVM...anity,ci_sanity,sanity,suite1] id=0x7efe213eeb20>, *args=(), **kwargs={})
78 log.info('Initial checks done. Running the testcase now')
79 log.info('')
80 result = function(self, *args, **kwargs)
81 if self.inputs.upgrade:
82 pid = os.getpid()
result = None
function = <function TestBasicVMVN.test_metadata_service>
self = <scripts.vm_regression.test_vm_basic.TestBasicVM...anity,ci_sanity,sanity,suite1] id=0x7efe213eeb20>
args = ()
kwargs = {}
/contrail-test/scripts/vm_regression/test_vm_basic.py in test_metadata_service(self=<scripts.vm_regression.test_vm_basic.TestBasicVM...anity,ci_sanity,sanity,suite1] id=0x7efe213eeb20>)
55 image_name='cirros',
56 userdata='/tmp/metadata_script.txt')
57 assert vm1_fixture.wait_till_vm_is_up()
58
59 cmd = 'cat /tmp/output.txt'
vm1_fixture = <VMFixture: ctest-TestBasicVMVN-06923401-51247530>
vm1_fixture.wait_till_vm_is_up = <bound method VMFixture.wait_till_vm_is_up of <VMFixture: ctest-TestBasicVMVN-06923401-51247530>>
AssertionError:
__cause__ = None
__class__ = <class 'AssertionError'>
__context__ = None
__delattr__ = <method-wrapper '__delattr__' of AssertionError object>
__dict__ = {}
__dir__ = <built-in method __dir__ of AssertionError object>
__doc__ = 'Assertion failed.'
__eq__ = <method-wrapper '__eq__' of AssertionError object>
__format__ = <built-in method __format__ of AssertionError object>
__ge__ = <method-wrapper '__ge__' of AssertionError object>
__getattribute__ = <method-wrapper '__getattribute__' of AssertionError object>
__gt__ = <method-wrapper '__gt__' of AssertionError object>
__hash__ = <method-wrapper '__hash__' of AssertionError object>
__init__ = <method-wrapper '__init__' of AssertionError object>
__init_subclass__ = <built-in method __init_subclass__ of type object>
__le__ = <method-wrapper '__le__' of AssertionError object>
__lt__ = <method-wrapper '__lt__' of AssertionError object>
__ne__ = <method-wrapper '__ne__' of AssertionError object>
__new__ = <built-in method __new__ of type object>
__reduce__ = <built-in method __reduce__ of AssertionError object>
__reduce_ex__ = <built-in method __reduce_ex__ of AssertionError object>
__repr__ = <method-wrapper '__repr__' of AssertionError object>
__setattr__ = <method-wrapper '__setattr__' of AssertionError object>
__setstate__ = <built-in method __setstate__ of AssertionError object>
__sizeof__ = <built-in method __sizeof__ of AssertionError object>
__str__ = <method-wrapper '__str__' of AssertionError object>
__subclasshook__ = <built-in method __subclasshook__ of type object>
__suppress_context__ = False
__traceback__ = <traceback object>
args = ()
with_traceback = <built-in method with_traceback of AssertionError object>
The above is a description of an error in a Python program. Here is
the original traceback:
Traceback (most recent call last):
File "/contrail-test/tcutils/wrappers.py", line 80, in wrapper
result = function(self, *args, **kwargs)
File "/contrail-test/scripts/vm_regression/test_vm_basic.py", line 57, in test_metadata_service
assert vm1_fixture.wait_till_vm_is_up()
AssertionError
| 156.944 |
Log File
|
| test_ping_within_vn_two_vms_two_different_subnets[ci_contrail_go_kolla_ocata_sanity,ci_sanity,sanity,suite1] | Failure | Details
Traceback (most recent call last):
testtools.testresult.real._StringException: Traceback (most recent call last):
File "/contrail-test/tcutils/wrappers.py", line 176, in wrapper
raise TestFailed("\n ".join(errmsg))
tcutils.cores.TestFailed: Test failed: AssertionError
Python 3.9.25: /usr/bin/python3
Mon Oct 5 04:37:02 2026
A problem occurred in a Python script. Here is the sequence of
function calls leading up to the error, in the order they occurred.
/contrail-test/tcutils/wrappers.py in wrapper(self=<scripts.vm_regression.test_vm_basic.TestBasicVM...anity,ci_sanity,sanity,suite1] id=0x7efe213eef40>, *args=(), **kwargs={})
78 log.info('Initial checks done. Running the testcase now')
79 log.info('')
80 result = function(self, *args, **kwargs)
81 if self.inputs.upgrade:
82 pid = os.getpid()
result = None
function = <function TestBasicVMVN.test_ping_within_vn_two_vms_two_different_subnets>
self = <scripts.vm_regression.test_vm_basic.TestBasicVM...anity,ci_sanity,sanity,suite1] id=0x7efe213eef40>
args = ()
kwargs = {}
/contrail-test/scripts/vm_regression/test_vm_basic.py in test_ping_within_vn_two_vms_two_different_subnets(self=<scripts.vm_regression.test_vm_basic.TestBasicVM...anity,ci_sanity,sanity,suite1] id=0x7efe213eef40>)
146 assert vn1_fixture.verify_on_setup()
147 assert vm1.wait_till_vm_is_up()
148 assert vm2.wait_till_vm_is_up()
149 assert vm3.wait_till_vm_is_up()
150 assert vm1.ping_to_ip(vm2.vm_ip)
vm2 = <VMFixture: ctest-TestBasicVMVN-06923401-91594560>
vm2.wait_till_vm_is_up = <bound method VMFixture.wait_till_vm_is_up of <VMFixture: ctest-TestBasicVMVN-06923401-91594560>>
AssertionError:
__cause__ = None
__class__ = <class 'AssertionError'>
__context__ = None
__delattr__ = <method-wrapper '__delattr__' of AssertionError object>
__dict__ = {}
__dir__ = <built-in method __dir__ of AssertionError object>
__doc__ = 'Assertion failed.'
__eq__ = <method-wrapper '__eq__' of AssertionError object>
__format__ = <built-in method __format__ of AssertionError object>
__ge__ = <method-wrapper '__ge__' of AssertionError object>
__getattribute__ = <method-wrapper '__getattribute__' of AssertionError object>
__gt__ = <method-wrapper '__gt__' of AssertionError object>
__hash__ = <method-wrapper '__hash__' of AssertionError object>
__init__ = <method-wrapper '__init__' of AssertionError object>
__init_subclass__ = <built-in method __init_subclass__ of type object>
__le__ = <method-wrapper '__le__' of AssertionError object>
__lt__ = <method-wrapper '__lt__' of AssertionError object>
__ne__ = <method-wrapper '__ne__' of AssertionError object>
__new__ = <built-in method __new__ of type object>
__reduce__ = <built-in method __reduce__ of AssertionError object>
__reduce_ex__ = <built-in method __reduce_ex__ of AssertionError object>
__repr__ = <method-wrapper '__repr__' of AssertionError object>
__setattr__ = <method-wrapper '__setattr__' of AssertionError object>
__setstate__ = <built-in method __setstate__ of AssertionError object>
__sizeof__ = <built-in method __sizeof__ of AssertionError object>
__str__ = <method-wrapper '__str__' of AssertionError object>
__subclasshook__ = <built-in method __subclasshook__ of type object>
__suppress_context__ = False
__traceback__ = <traceback object>
args = ()
with_traceback = <built-in method with_traceback of AssertionError object>
The above is a description of an error in a Python program. Here is
the original traceback:
Traceback (most recent call last):
File "/contrail-test/tcutils/wrappers.py", line 80, in wrapper
result = function(self, *args, **kwargs)
File "/contrail-test/scripts/vm_regression/test_vm_basic.py", line 148, in test_ping_within_vn_two_vms_two_different_subnets
assert vm2.wait_till_vm_is_up()
AssertionError
| 213.436 |
Log File
|
| test_ecmp_with_static_routes[cb_sanity,dev_reg,sanity] | Failure | Details
Traceback (most recent call last):
testtools.testresult.real._StringException: Traceback (most recent call last):
File "/contrail-test/tcutils/util.py", line 1041, in wrapper
return f(self, *func_args, **func_kwargs)
File "/contrail-test/scripts/vrouter/test_disable_policy.py", line 735, in test_ecmp_with_static_routes
super(DisablePolicyEcmpIpv6, self).test_ecmp_with_static_routes()
File "/contrail-test/tcutils/util.py", line 1041, in wrapper
return f(self, *func_args, **func_kwargs)
File "/contrail-test/tcutils/wrappers.py", line 176, in wrapper
raise TestFailed("\n ".join(errmsg))
tcutils.cores.TestFailed: Test failed: AssertionError
Python 3.9.25: /usr/bin/python3
Mon Oct 5 04:39:52 2026
A problem occurred in a Python script. Here is the sequence of
function calls leading up to the error, in the order they occurred.
/contrail-test/tcutils/wrappers.py in wrapper(self=<scripts.vrouter.test_disable_policy.DisablePoli...utes[cb_sanity,dev_reg,sanity] id=0x7efe213feb20>, *args=(), **kwargs={})
78 log.info('Initial checks done. Running the testcase now')
79 log.info('')
80 result = function(self, *args, **kwargs)
81 if self.inputs.upgrade:
82 pid = os.getpid()
result = None
function = <function DisablePolicyEcmp.test_ecmp_with_static_routes>
self = <scripts.vrouter.test_disable_policy.DisablePoli...utes[cb_sanity,dev_reg,sanity] id=0x7efe213feb20>
args = ()
kwargs = {}
/contrail-test/scripts/vrouter/test_disable_policy.py in test_ecmp_with_static_routes(self=<scripts.vrouter.test_disable_policy.DisablePoli...utes[cb_sanity,dev_reg,sanity] id=0x7efe213feb20>)
63 node_name=compute_hosts[0], image_name=image)[0]
64
65 self.verify_vms(vm_fixtures)
66 self.verify_vms(vm1_fixture)
67 vm1_fixture = vm1_fixture[0]
self = <scripts.vrouter.test_disable_policy.DisablePoli...utes[cb_sanity,dev_reg,sanity] id=0x7efe213feb20>
self.verify_vms = <bound method BaseVrouterTest.verify_vms of <scr...tes[cb_sanity,dev_reg,sanity] id=0x7efe213feb20>>
vm_fixtures = [<VMFixture: ctest-DisablePolicyEcmpIpv6-38404315-22678010>, <VMFixture: ctest-DisablePolicyEcmpIpv6-38404315-59909840>]
/contrail-test/common/vrouter/base.py in verify_vms(self=<scripts.vrouter.test_disable_policy.DisablePoli...utes[cb_sanity,dev_reg,sanity] id=0x7efe213feb20>, vm_fixtures=[<VMFixture: ctest-DisablePolicyEcmpIpv6-38404315-22678010>, <VMFixture: ctest-DisablePolicyEcmpIpv6-38404315-59909840>])
198 def verify_vms(self, vm_fixtures):
199 for vm_fixture in vm_fixtures:
200 assert vm_fixture.wait_till_vm_is_up()
201
202 def add_static_routes_on_vms(self,prefix, vm_fixtures, ip=None):
vm_fixture = <VMFixture: ctest-DisablePolicyEcmpIpv6-38404315-22678010>
vm_fixture.wait_till_vm_is_up = <bound method VMFixture.wait_till_vm_is_up of <V...: ctest-DisablePolicyEcmpIpv6-38404315-22678010>>
AssertionError:
__cause__ = None
__class__ = <class 'AssertionError'>
__context__ = None
__delattr__ = <method-wrapper '__delattr__' of AssertionError object>
__dict__ = {}
__dir__ = <built-in method __dir__ of AssertionError object>
__doc__ = 'Assertion failed.'
__eq__ = <method-wrapper '__eq__' of AssertionError object>
__format__ = <built-in method __format__ of AssertionError object>
__ge__ = <method-wrapper '__ge__' of AssertionError object>
__getattribute__ = <method-wrapper '__getattribute__' of AssertionError object>
__gt__ = <method-wrapper '__gt__' of AssertionError object>
__hash__ = <method-wrapper '__hash__' of AssertionError object>
__init__ = <method-wrapper '__init__' of AssertionError object>
__init_subclass__ = <built-in method __init_subclass__ of type object>
__le__ = <method-wrapper '__le__' of AssertionError object>
__lt__ = <method-wrapper '__lt__' of AssertionError object>
__ne__ = <method-wrapper '__ne__' of AssertionError object>
__new__ = <built-in method __new__ of type object>
__reduce__ = <built-in method __reduce__ of AssertionError object>
__reduce_ex__ = <built-in method __reduce_ex__ of AssertionError object>
__repr__ = <method-wrapper '__repr__' of AssertionError object>
__setattr__ = <method-wrapper '__setattr__' of AssertionError object>
__setstate__ = <built-in method __setstate__ of AssertionError object>
__sizeof__ = <built-in method __sizeof__ of AssertionError object>
__str__ = <method-wrapper '__str__' of AssertionError object>
__subclasshook__ = <built-in method __subclasshook__ of type object>
__suppress_context__ = False
__traceback__ = <traceback object>
args = ()
with_traceback = <built-in method with_traceback of AssertionError object>
The above is a description of an error in a Python program. Here is
the original traceback:
Traceback (most recent call last):
File "/contrail-test/tcutils/wrappers.py", line 80, in wrapper
result = function(self, *args, **kwargs)
File "/contrail-test/scripts/vrouter/test_disable_policy.py", line 65, in test_ecmp_with_static_routes
self.verify_vms(vm_fixtures)
File "/contrail-test/common/vrouter/base.py", line 200, in verify_vms
assert vm_fixture.wait_till_vm_is_up()
AssertionError
| 166.886 |
Log File
|
| test_bond_lacp_config[dev_reg,sanity] | Skipped | Skipped as test is not supported if dpdk_cluster=False | 2.668 | |
| test_dpdk_bond_status[dev_reg,sanity] | Skipped | Skipped as test is not supported if dpdk_cluster=False | 2.686 | |
| test_fbit_disable_mbuf_dpdk[dev_reg,sanity] | Skipped | Skipped as test is not supported if dpdk_cluster=False | 2.647 | |
| test_dpdk_gro_gso[dev_reg,sanity] | Skipped | Skipped as test is not supported if dpdk_cluster=False | 2.724 | |
| test_mtu_config[dev_reg,sanity] | Skipped | Skipped as test is not supported if dpdk_cluster=False | 2.659 | |
| test_vifdump_on_interface[dev_reg,sanity] | Skipped | Skipped as test is not supported if dpdk_cluster=False | 2.698 | |
| test_fat_flow_aggr_dest_icmp_intra_vn_inter_node[dev_reg,sanity] | Failure | Details
Traceback (most recent call last):
testtools.testresult.real._StringException: Traceback (most recent call last):
File "/contrail-test/tcutils/wrappers.py", line 176, in wrapper
raise TestFailed("\n ".join(errmsg))
tcutils.cores.TestFailed: Test failed: AssertionError
Python 3.9.25: /usr/bin/python3
Mon Oct 5 04:46:00 2026
A problem occurred in a Python script. Here is the sequence of
function calls leading up to the error, in the order they occurred.
/contrail-test/tcutils/wrappers.py in wrapper(self=<scripts.vrouter.test_fat_flow_aggr.FatFlowAggr...._vn_inter_node[dev_reg,sanity] id=0x7efe214245b0>, *args=(), **kwargs={})
78 log.info('Initial checks done. Running the testcase now')
79 log.info('')
80 result = function(self, *args, **kwargs)
81 if self.inputs.upgrade:
82 pid = os.getpid()
result = None
function = <function FatFlowAggr.test_fat_flow_aggr_dest_icmp_intra_vn_inter_node>
self = <scripts.vrouter.test_fat_flow_aggr.FatFlowAggr...._vn_inter_node[dev_reg,sanity] id=0x7efe214245b0>
args = ()
kwargs = {}
/contrail-test/scripts/vrouter/test_fat_flow_aggr.py in test_fat_flow_aggr_dest_icmp_intra_vn_inter_node(self=<scripts.vrouter.test_fat_flow_aggr.FatFlowAggr...._vn_inter_node[dev_reg,sanity] id=0x7efe214245b0>)
56 policy_deny = False
57 vn_policy = False
58 self.fat_flow_with_prefix_aggr(prefix_length=prefix_length,
59 inter_node=inter_node,inter_vn=inter_vn,
60 proto=proto, port=port, policy_deny=policy_deny, vn_policy=vn_policy,
self = <scripts.vrouter.test_fat_flow_aggr.FatFlowAggr...._vn_inter_node[dev_reg,sanity] id=0x7efe214245b0>
self.fat_flow_with_prefix_aggr = <bound method BaseVrouterTest.fat_flow_with_pref...vn_inter_node[dev_reg,sanity] id=0x7efe214245b0>>
prefix_length = 27
inter_node = True
inter_vn = False
proto = 'icmp'
port = 0
policy_deny = False
vn_policy = False
dual undefined
ipv6 = False
prefix_length6 = 123
only_v6 = False
/contrail-test/common/vrouter/base.py in fat_flow_with_prefix_aggr(self=<scripts.vrouter.test_fat_flow_aggr.FatFlowAggr...._vn_inter_node[dev_reg,sanity] id=0x7efe214245b0>, prefix_length=27, prefix_length6=123, inter_node=True, inter_vn=False, dual=False, traffic_recvr=False, unidirectional_traffic=True, ignore_address=None, proto='icmp', port=0, portv6=56, svc_chain=False, only_v6=False, af='v4', icmp_error=False, hc=None, vn_policy=False, policy_deny=False, svm_inter_node=False, resources=True, scale=False)
422 node_name=server_compute)
423 for server in self.server_fixtures:
424 assert server.wait_till_vm_is_up()
425
426 server_fixtures = self.server_fixtures
server = <VMFixture: ctest-FatFlowAggr-76866387-68435324>
server.wait_till_vm_is_up = <bound method VMFixture.wait_till_vm_is_up of <VMFixture: ctest-FatFlowAggr-76866387-68435324>>
AssertionError:
__cause__ = None
__class__ = <class 'AssertionError'>
__context__ = None
__delattr__ = <method-wrapper '__delattr__' of AssertionError object>
__dict__ = {}
__dir__ = <built-in method __dir__ of AssertionError object>
__doc__ = 'Assertion failed.'
__eq__ = <method-wrapper '__eq__' of AssertionError object>
__format__ = <built-in method __format__ of AssertionError object>
__ge__ = <method-wrapper '__ge__' of AssertionError object>
__getattribute__ = <method-wrapper '__getattribute__' of AssertionError object>
__gt__ = <method-wrapper '__gt__' of AssertionError object>
__hash__ = <method-wrapper '__hash__' of AssertionError object>
__init__ = <method-wrapper '__init__' of AssertionError object>
__init_subclass__ = <built-in method __init_subclass__ of type object>
__le__ = <method-wrapper '__le__' of AssertionError object>
__lt__ = <method-wrapper '__lt__' of AssertionError object>
__ne__ = <method-wrapper '__ne__' of AssertionError object>
__new__ = <built-in method __new__ of type object>
__reduce__ = <built-in method __reduce__ of AssertionError object>
__reduce_ex__ = <built-in method __reduce_ex__ of AssertionError object>
__repr__ = <method-wrapper '__repr__' of AssertionError object>
__setattr__ = <method-wrapper '__setattr__' of AssertionError object>
__setstate__ = <built-in method __setstate__ of AssertionError object>
__sizeof__ = <built-in method __sizeof__ of AssertionError object>
__str__ = <method-wrapper '__str__' of AssertionError object>
__subclasshook__ = <built-in method __subclasshook__ of type object>
__suppress_context__ = False
__traceback__ = <traceback object>
args = ()
with_traceback = <built-in method with_traceback of AssertionError object>
The above is a description of an error in a Python program. Here is
the original traceback:
Traceback (most recent call last):
File "/contrail-test/tcutils/wrappers.py", line 80, in wrapper
result = function(self, *args, **kwargs)
File "/contrail-test/scripts/vrouter/test_fat_flow_aggr.py", line 58, in test_fat_flow_aggr_dest_icmp_intra_vn_inter_node
self.fat_flow_with_prefix_aggr(prefix_length=prefix_length,
File "/contrail-test/common/vrouter/base.py", line 424, in fat_flow_with_prefix_aggr
assert server.wait_till_vm_is_up()
AssertionError
| 323.783 |
Log File
|
| test_rt_table_scenario_1[dev_reg,sanity] | Success | | 213.832 | |
| test_vlan_interface_2[cb_sanity,dev_reg,dev_sanity_dpdk,sanity] | Failure | Details
Traceback (most recent call last):
testtools.testresult.real._StringException: Traceback (most recent call last):
File "/contrail-test/tcutils/wrappers.py", line 176, in wrapper
raise TestFailed("\n ".join(errmsg))
tcutils.cores.TestFailed: Test failed: AssertionError
Python 3.9.25: /usr/bin/python3
Mon Oct 5 04:54:14 2026
A problem occurred in a Python script. Here is the sequence of
function calls leading up to the error, in the order they occurred.
/contrail-test/tcutils/wrappers.py in wrapper(self=<scripts.vrouter.test_subinterfaces.TestSubInter...ev_reg,dev_sanity_dpdk,sanity] id=0x7efe213b6cd0>, *args=(), **kwargs={})
78 log.info('Initial checks done. Running the testcase now')
79 log.info('')
80 result = function(self, *args, **kwargs)
81 if self.inputs.upgrade:
82 pid = os.getpid()
result = None
function = <function TestSubInterfaces.test_vlan_interface_2>
self = <scripts.vrouter.test_subinterfaces.TestSubInter...ev_reg,dev_sanity_dpdk,sanity] id=0x7efe213b6cd0>
args = ()
kwargs = {}
/contrail-test/scripts/vrouter/test_subinterfaces.py in test_vlan_interface_2(self=<scripts.vrouter.test_subinterfaces.TestSubInter...ev_reg,dev_sanity_dpdk,sanity] id=0x7efe213b6cd0>)
117
118 assert vm1_fixture.wait_till_vm_is_up()
119 assert vm2_fixture.wait_till_vm_is_up()
120 assert vm3_fixture.wait_till_vm_is_up()
121
vm2_fixture = <VMFixture: ctest-TestSubInterfaces-34575999-59109820>
vm2_fixture.wait_till_vm_is_up = <bound method VMFixture.wait_till_vm_is_up of <V...ture: ctest-TestSubInterfaces-34575999-59109820>>
AssertionError:
__cause__ = None
__class__ = <class 'AssertionError'>
__context__ = None
__delattr__ = <method-wrapper '__delattr__' of AssertionError object>
__dict__ = {}
__dir__ = <built-in method __dir__ of AssertionError object>
__doc__ = 'Assertion failed.'
__eq__ = <method-wrapper '__eq__' of AssertionError object>
__format__ = <built-in method __format__ of AssertionError object>
__ge__ = <method-wrapper '__ge__' of AssertionError object>
__getattribute__ = <method-wrapper '__getattribute__' of AssertionError object>
__gt__ = <method-wrapper '__gt__' of AssertionError object>
__hash__ = <method-wrapper '__hash__' of AssertionError object>
__init__ = <method-wrapper '__init__' of AssertionError object>
__init_subclass__ = <built-in method __init_subclass__ of type object>
__le__ = <method-wrapper '__le__' of AssertionError object>
__lt__ = <method-wrapper '__lt__' of AssertionError object>
__ne__ = <method-wrapper '__ne__' of AssertionError object>
__new__ = <built-in method __new__ of type object>
__reduce__ = <built-in method __reduce__ of AssertionError object>
__reduce_ex__ = <built-in method __reduce_ex__ of AssertionError object>
__repr__ = <method-wrapper '__repr__' of AssertionError object>
__setattr__ = <method-wrapper '__setattr__' of AssertionError object>
__setstate__ = <built-in method __setstate__ of AssertionError object>
__sizeof__ = <built-in method __sizeof__ of AssertionError object>
__str__ = <method-wrapper '__str__' of AssertionError object>
__subclasshook__ = <built-in method __subclasshook__ of type object>
__suppress_context__ = False
__traceback__ = <traceback object>
args = ()
with_traceback = <built-in method with_traceback of AssertionError object>
The above is a description of an error in a Python program. Here is
the original traceback:
Traceback (most recent call last):
File "/contrail-test/tcutils/wrappers.py", line 80, in wrapper
result = function(self, *args, **kwargs)
File "/contrail-test/scripts/vrouter/test_subinterfaces.py", line 119, in test_vlan_interface_2
assert vm2_fixture.wait_till_vm_is_up()
AssertionError
| 262.265 |
Log File
|
| test_mtu_probe_intra_node[dev_reg,sanity] | Success | | 155.612 | |
| test_vif_statistics[dev_reg,sanity] | Success | | 130.662 | |
| Name | Status | Type | Time(s) | LogFile |
| test_run_contrail_flows_cli_cmds[sanity] | Success | | 17.228 | |
| test_run_contrail_logs_cli_cmd_with_multiple_different_optional_args[sanity] | Success | | 23.208 | |
| test_run_contrail_stats_cli_cmds[sanity] | Success | | 29.342 | |
| setUpClass (serial_scripts.analytics.test_analytics_resource.AnalyticsTestSanityWithResource) | Failure | Details
Traceback (most recent call last):
testtools.testresult.real._StringException: Traceback (most recent call last):
File "/contrail-test/serial_scripts/analytics/test_analytics_resource.py", line 249, in setUpClass
cls.res.setUp(cls.inputs, cls.connections)
File "/contrail-test/serial_scripts/analytics/base.py", line 773, in setUp
super(AnalyticsTestSanityWithResourceResource , self).setUp(inputs,connections)
File "/contrail-test/serial_scripts/analytics/base.py", line 594, in setUp
self.setup_common_objects(self.inputs , self.connections)
File "/contrail-test/serial_scripts/analytics/base.py", line 636, in setup_common_objects
self.verify_common_objects()
File "/contrail-test/serial_scripts/analytics/base.py", line 643, in verify_common_objects
assert self.fvn_vm1_fixture.wait_till_vm_is_up()
AssertionError
| 0.000 |
Log File
|
| test_basic_as4_ibgp_sanity[sanity] | Skipped | Skipping Test. At least 1 external router required to run the test | 2.648 | |
| test_basic_bgpaas_local_as[dev_sanity_dpdk,sanity] | Failure | Details
Traceback (most recent call last):
testtools.testresult.real._StringException: stdout: {{{
[localhost] local: mkdir -p /contrail-test/images
[localhost] local: wget -nv http://nexus.opensdn.io/repository///images/converts//ubuntu-bird.vmdk.gz -O /contrail-test/images/ubuntu-bird.vmdk.gz
[localhost] local: gunzip -f /contrail-test/images/ubuntu-bird.vmdk.gz
[localhost] local: rm -f /contrail-test/images/ubuntu-bird.vmdk
}}}
Traceback (most recent call last):
File "/contrail-test/tcutils/wrappers.py", line 176, in wrapper
raise TestFailed("\n ".join(errmsg))
tcutils.cores.TestFailed: Test failed: AssertionError
Python 3.9.25: /usr/bin/python3
Mon Oct 5 05:09:35 2026
A problem occurred in a Python script. Here is the sequence of
function calls leading up to the error, in the order they occurred.
/contrail-test/tcutils/wrappers.py in wrapper(self=<serial_scripts.bgpaas.test_bgpaas_local_as.Test...cal_as[dev_sanity_dpdk,sanity] id=0x7f8f35f087c0>, *args=(), **kwargs={})
78 log.info('Initial checks done. Running the testcase now')
79 log.info('')
80 result = function(self, *args, **kwargs)
81 if self.inputs.upgrade:
82 pid = os.getpid()
result = None
function = <function TestBGPaaSlocalAS.test_basic_bgpaas_local_as>
self = <serial_scripts.bgpaas.test_bgpaas_local_as.Test...cal_as[dev_sanity_dpdk,sanity] id=0x7f8f35f087c0>
args = ()
kwargs = {}
/contrail-test/serial_scripts/bgpaas/test_bgpaas_local_as.py in test_basic_bgpaas_local_as(self=<serial_scripts.bgpaas.test_bgpaas_local_as.Test...cal_as[dev_sanity_dpdk,sanity] id=0x7f8f35f087c0>)
31 2. Make sure BGP with vm comes up.
32 '''
33 ret_dict = self.config_basic(image_name='ubuntu-bird')
34 vn_fixture = ret_dict['vn_fixture']
35 test_vm = ret_dict['test_vm']
ret_dict undefined
self = <serial_scripts.bgpaas.test_bgpaas_local_as.Test...cal_as[dev_sanity_dpdk,sanity] id=0x7f8f35f087c0>
self.config_basic = <bound method LocalASBase.config_basic of <seria...al_as[dev_sanity_dpdk,sanity] id=0x7f8f35f087c0>>
image_name undefined
/contrail-test/serial_scripts/bgpaas/base.py in config_basic(self=<serial_scripts.bgpaas.test_bgpaas_local_as.Test...cal_as[dev_sanity_dpdk,sanity] id=0x7f8f35f087c0>, image_name='ubuntu-bird')
47
48 assert test_vm.wait_till_vm_is_up()
49 assert bgpaas_vm1.wait_till_vm_is_up()
50 ret_dict = {
51 'vn_fixture': vn_fixture,
bgpaas_vm1 = <VMFixture: bgpaas_vm1>
bgpaas_vm1.wait_till_vm_is_up = <bound method VMFixture.wait_till_vm_is_up of <VMFixture: bgpaas_vm1>>
AssertionError:
__cause__ = None
__class__ = <class 'AssertionError'>
__context__ = None
__delattr__ = <method-wrapper '__delattr__' of AssertionError object>
__dict__ = {}
__dir__ = <built-in method __dir__ of AssertionError object>
__doc__ = 'Assertion failed.'
__eq__ = <method-wrapper '__eq__' of AssertionError object>
__format__ = <built-in method __format__ of AssertionError object>
__ge__ = <method-wrapper '__ge__' of AssertionError object>
__getattribute__ = <method-wrapper '__getattribute__' of AssertionError object>
__gt__ = <method-wrapper '__gt__' of AssertionError object>
__hash__ = <method-wrapper '__hash__' of AssertionError object>
__init__ = <method-wrapper '__init__' of AssertionError object>
__init_subclass__ = <built-in method __init_subclass__ of type object>
__le__ = <method-wrapper '__le__' of AssertionError object>
__lt__ = <method-wrapper '__lt__' of AssertionError object>
__ne__ = <method-wrapper '__ne__' of AssertionError object>
__new__ = <built-in method __new__ of type object>
__reduce__ = <built-in method __reduce__ of AssertionError object>
__reduce_ex__ = <built-in method __reduce_ex__ of AssertionError object>
__repr__ = <method-wrapper '__repr__' of AssertionError object>
__setattr__ = <method-wrapper '__setattr__' of AssertionError object>
__setstate__ = <built-in method __setstate__ of AssertionError object>
__sizeof__ = <built-in method __sizeof__ of AssertionError object>
__str__ = <method-wrapper '__str__' of AssertionError object>
__subclasshook__ = <built-in method __subclasshook__ of type object>
__suppress_context__ = False
__traceback__ = <traceback object>
args = ()
with_traceback = <built-in method with_traceback of AssertionError object>
The above is a description of an error in a Python program. Here is
the original traceback:
Traceback (most recent call last):
File "/contrail-test/tcutils/wrappers.py", line 80, in wrapper
result = function(self, *args, **kwargs)
File "/contrail-test/serial_scripts/bgpaas/test_bgpaas_local_as.py", line 33, in test_basic_bgpaas_local_as
ret_dict = self.config_basic(image_name='ubuntu-bird')
File "/contrail-test/serial_scripts/bgpaas/base.py", line 49, in config_basic
assert bgpaas_vm1.wait_till_vm_is_up()
AssertionError
| 210.993 |
Log File
|
| test_bgp_control_node_zone[sanity] | Failure | Details
Traceback (most recent call last):
testtools.testresult.real._StringException: Traceback (most recent call last):
File "/contrail-test/tcutils/wrappers.py", line 176, in wrapper
raise TestFailed("\n ".join(errmsg))
tcutils.cores.TestFailed: Test failed: AssertionError
Python 3.9.25: /usr/bin/python3
Mon Oct 5 05:16:00 2026
A problem occurred in a Python script. Here is the sequence of
function calls leading up to the error, in the order they occurred.
/contrail-test/tcutils/wrappers.py in wrapper(self=<serial_scripts.bgpaas.test_bgpaas_zone.TestBGPa..._bgp_control_node_zone[sanity] id=0x7f8f35f128b0>, *args=(), **kwargs={})
78 log.info('Initial checks done. Running the testcase now')
79 log.info('')
80 result = function(self, *args, **kwargs)
81 if self.inputs.upgrade:
82 pid = os.getpid()
result = None
function = <function TestBGPaasZone.test_bgp_control_node_zone>
self = <serial_scripts.bgpaas.test_bgpaas_zone.TestBGPa..._bgp_control_node_zone[sanity] id=0x7f8f35f128b0>
args = ()
kwargs = {}
/contrail-test/serial_scripts/bgpaas/test_bgpaas_zone.py in test_bgp_control_node_zone(self=<serial_scripts.bgpaas.test_bgpaas_zone.TestBGPa..._bgp_control_node_zone[sanity] id=0x7f8f35f128b0>)
57 cnt = 0
58 self.logger.info('executing bgp_control_zone test')
59 assert self.basic_control_node_zone_setup()
60 # update control node zone with different bgp routers
61 self.update_control_node_zones(self.cnzs)
self = <serial_scripts.bgpaas.test_bgpaas_zone.TestBGPa..._bgp_control_node_zone[sanity] id=0x7f8f35f128b0>
self.basic_control_node_zone_setup = <bound method TestBGPaasZone.basic_control_node_...bgp_control_node_zone[sanity] id=0x7f8f35f128b0>>
/contrail-test/serial_scripts/bgpaas/test_bgpaas_zone.py in basic_control_node_zone_setup(self=<serial_scripts.bgpaas.test_bgpaas_zone.TestBGPa..._bgp_control_node_zone[sanity] id=0x7f8f35f128b0>, ctrl_zone=None)
31 self.vms.append(self.create_vm(vn_fixture=self.vn, image_name='ubuntu-bird'))
32 self.client_vm = self.create_vm(vn_fixture=self.vn, image_name='ubuntu-bird')
33 self.check_vms_booted(self.vms + [self.client_vm])
34 for bgp_name in self.inputs.bgp_names:
35 self.cnzs += self.create_control_node_zones("test-zone",[bgp_name])
self = <serial_scripts.bgpaas.test_bgpaas_zone.TestBGPa..._bgp_control_node_zone[sanity] id=0x7f8f35f128b0>
self.check_vms_booted = <bound method GenericTestBase.check_vms_booted o...scripts.bgpaas.test_bgpaas_zone.TestBGPaasZone'>>
self.vms = [<VMFixture: ctest-TestBGPaasZone-38142884-61930969>, <VMFixture: ctest-TestBGPaasZone-38142884-92059372>]
self.client_vm = <VMFixture: ctest-TestBGPaasZone-38142884-34517296>
/contrail-test/common/base.py in check_vms_booted(cls=<class 'serial_scripts.bgpaas.test_bgpaas_zone.TestBGPaasZone'>, vms_list=[<VMFixture: ctest-TestBGPaasZone-38142884-61930969>, <VMFixture: ctest-TestBGPaasZone-38142884-92059372>, <VMFixture: ctest-TestBGPaasZone-38142884-34517296>], do_assert=True)
720 for vm_fixture in vms_list:
721 vm_fixture.cleanUp()
722 assert False, 'One or more vm-boots failed. Check logs'
723 if failed:
724 return False
AssertionError: One or more vm-boots failed. Check logs
__cause__ = None
__class__ = <class 'AssertionError'>
__context__ = None
__delattr__ = <method-wrapper '__delattr__' of AssertionError object>
__dict__ = {}
__dir__ = <built-in method __dir__ of AssertionError object>
__doc__ = 'Assertion failed.'
__eq__ = <method-wrapper '__eq__' of AssertionError object>
__format__ = <built-in method __format__ of AssertionError object>
__ge__ = <method-wrapper '__ge__' of AssertionError object>
__getattribute__ = <method-wrapper '__getattribute__' of AssertionError object>
__gt__ = <method-wrapper '__gt__' of AssertionError object>
__hash__ = <method-wrapper '__hash__' of AssertionError object>
__init__ = <method-wrapper '__init__' of AssertionError object>
__init_subclass__ = <built-in method __init_subclass__ of type object>
__le__ = <method-wrapper '__le__' of AssertionError object>
__lt__ = <method-wrapper '__lt__' of AssertionError object>
__ne__ = <method-wrapper '__ne__' of AssertionError object>
__new__ = <built-in method __new__ of type object>
__reduce__ = <built-in method __reduce__ of AssertionError object>
__reduce_ex__ = <built-in method __reduce_ex__ of AssertionError object>
__repr__ = <method-wrapper '__repr__' of AssertionError object>
__setattr__ = <method-wrapper '__setattr__' of AssertionError object>
__setstate__ = <built-in method __setstate__ of AssertionError object>
__sizeof__ = <built-in method __sizeof__ of AssertionError object>
__str__ = <method-wrapper '__str__' of AssertionError object>
__subclasshook__ = <built-in method __subclasshook__ of type object>
__suppress_context__ = False
__traceback__ = <traceback object>
args = ('One or more vm-boots failed. Check logs',)
with_traceback = <built-in method with_traceback of AssertionError object>
The above is a description of an error in a Python program. Here is
the original traceback:
Traceback (most recent call last):
File "/contrail-test/tcutils/wrappers.py", line 80, in wrapper
result = function(self, *args, **kwargs)
File "/contrail-test/serial_scripts/bgpaas/test_bgpaas_zone.py", line 59, in test_bgp_control_node_zone
assert self.basic_control_node_zone_setup()
File "/contrail-test/serial_scripts/bgpaas/test_bgpaas_zone.py", line 33, in basic_control_node_zone_setup
self.check_vms_booted(self.vms + [self.client_vm])
File "/contrail-test/common/base.py", line 722, in check_vms_booted
assert False, 'One or more vm-boots failed. Check logs'
AssertionError: One or more vm-boots failed. Check logs
| 380.680 |
Log File
|
| test_bgp_control_node_zones_from_single_vnf[sanity] | Failure | Details
Traceback (most recent call last):
testtools.testresult.real._StringException: Traceback (most recent call last):
File "/contrail-test/tcutils/wrappers.py", line 176, in wrapper
raise TestFailed("\n ".join(errmsg))
tcutils.cores.TestFailed: Test failed: AssertionError
Python 3.9.25: /usr/bin/python3
Mon Oct 5 05:18:44 2026
A problem occurred in a Python script. Here is the sequence of
function calls leading up to the error, in the order they occurred.
/contrail-test/tcutils/wrappers.py in wrapper(self=<serial_scripts.bgpaas.test_bgpaas_zone.TestBGPa..._zones_from_single_vnf[sanity] id=0x7f8f35f12af0>, *args=(), **kwargs={})
78 log.info('Initial checks done. Running the testcase now')
79 log.info('')
80 result = function(self, *args, **kwargs)
81 if self.inputs.upgrade:
82 pid = os.getpid()
result = None
function = <function TestBGPaasZone.test_bgp_control_node_zones_from_single_vnf>
self = <serial_scripts.bgpaas.test_bgpaas_zone.TestBGPa..._zones_from_single_vnf[sanity] id=0x7f8f35f12af0>
args = ()
kwargs = {}
/contrail-test/serial_scripts/bgpaas/test_bgpaas_zone.py in test_bgp_control_node_zones_from_single_vnf(self=<serial_scripts.bgpaas.test_bgpaas_zone.TestBGPa..._zones_from_single_vnf[sanity] id=0x7f8f35f12af0>)
145 self.logger.info('executing bgp_control_zone agent restart test')
146 host_ips = []
147 assert self.basic_control_node_zone_setup('both-zones')
148 for vm in self.vms:
149 assert self.verify_bgpaas_in_control_nodes_and_agent(self.bgpaas_fixtures[cnt],vm)
self = <serial_scripts.bgpaas.test_bgpaas_zone.TestBGPa..._zones_from_single_vnf[sanity] id=0x7f8f35f12af0>
self.basic_control_node_zone_setup = <bound method TestBGPaasZone.basic_control_node_...zones_from_single_vnf[sanity] id=0x7f8f35f12af0>>
/contrail-test/serial_scripts/bgpaas/test_bgpaas_zone.py in basic_control_node_zone_setup(self=<serial_scripts.bgpaas.test_bgpaas_zone.TestBGPa..._zones_from_single_vnf[sanity] id=0x7f8f35f12af0>, ctrl_zone='both-zones')
31 self.vms.append(self.create_vm(vn_fixture=self.vn, image_name='ubuntu-bird'))
32 self.client_vm = self.create_vm(vn_fixture=self.vn, image_name='ubuntu-bird')
33 self.check_vms_booted(self.vms + [self.client_vm])
34 for bgp_name in self.inputs.bgp_names:
35 self.cnzs += self.create_control_node_zones("test-zone",[bgp_name])
self = <serial_scripts.bgpaas.test_bgpaas_zone.TestBGPa..._zones_from_single_vnf[sanity] id=0x7f8f35f12af0>
self.check_vms_booted = <bound method GenericTestBase.check_vms_booted o...scripts.bgpaas.test_bgpaas_zone.TestBGPaasZone'>>
self.vms = [<VMFixture: ctest-TestBGPaasZone-38142884-86148002>, <VMFixture: ctest-TestBGPaasZone-38142884-08810107>]
self.client_vm = <VMFixture: ctest-TestBGPaasZone-38142884-30093862>
/contrail-test/common/base.py in check_vms_booted(cls=<class 'serial_scripts.bgpaas.test_bgpaas_zone.TestBGPaasZone'>, vms_list=[<VMFixture: ctest-TestBGPaasZone-38142884-86148002>, <VMFixture: ctest-TestBGPaasZone-38142884-08810107>, <VMFixture: ctest-TestBGPaasZone-38142884-30093862>], do_assert=True)
720 for vm_fixture in vms_list:
721 vm_fixture.cleanUp()
722 assert False, 'One or more vm-boots failed. Check logs'
723 if failed:
724 return False
AssertionError: One or more vm-boots failed. Check logs
__cause__ = None
__class__ = <class 'AssertionError'>
__context__ = None
__delattr__ = <method-wrapper '__delattr__' of AssertionError object>
__dict__ = {}
__dir__ = <built-in method __dir__ of AssertionError object>
__doc__ = 'Assertion failed.'
__eq__ = <method-wrapper '__eq__' of AssertionError object>
__format__ = <built-in method __format__ of AssertionError object>
__ge__ = <method-wrapper '__ge__' of AssertionError object>
__getattribute__ = <method-wrapper '__getattribute__' of AssertionError object>
__gt__ = <method-wrapper '__gt__' of AssertionError object>
__hash__ = <method-wrapper '__hash__' of AssertionError object>
__init__ = <method-wrapper '__init__' of AssertionError object>
__init_subclass__ = <built-in method __init_subclass__ of type object>
__le__ = <method-wrapper '__le__' of AssertionError object>
__lt__ = <method-wrapper '__lt__' of AssertionError object>
__ne__ = <method-wrapper '__ne__' of AssertionError object>
__new__ = <built-in method __new__ of type object>
__reduce__ = <built-in method __reduce__ of AssertionError object>
__reduce_ex__ = <built-in method __reduce_ex__ of AssertionError object>
__repr__ = <method-wrapper '__repr__' of AssertionError object>
__setattr__ = <method-wrapper '__setattr__' of AssertionError object>
__setstate__ = <built-in method __setstate__ of AssertionError object>
__sizeof__ = <built-in method __sizeof__ of AssertionError object>
__str__ = <method-wrapper '__str__' of AssertionError object>
__subclasshook__ = <built-in method __subclasshook__ of type object>
__suppress_context__ = False
__traceback__ = <traceback object>
args = ('One or more vm-boots failed. Check logs',)
with_traceback = <built-in method with_traceback of AssertionError object>
The above is a description of an error in a Python program. Here is
the original traceback:
Traceback (most recent call last):
File "/contrail-test/tcutils/wrappers.py", line 80, in wrapper
result = function(self, *args, **kwargs)
File "/contrail-test/serial_scripts/bgpaas/test_bgpaas_zone.py", line 147, in test_bgp_control_node_zones_from_single_vnf
assert self.basic_control_node_zone_setup('both-zones')
File "/contrail-test/serial_scripts/bgpaas/test_bgpaas_zone.py", line 33, in basic_control_node_zone_setup
self.check_vms_booted(self.vms + [self.client_vm])
File "/contrail-test/common/base.py", line 722, in check_vms_booted
assert False, 'One or more vm-boots failed. Check logs'
AssertionError: One or more vm-boots failed. Check logs
| 161.505 |
Log File
|
| test_basic_dm[sanity] | Skipped | dm_mx env needs to be set in testbed.py to run this script | 2.652 | |
| test_apply_policy_fip_on_same_vn_gw_mx[sanity,serial] | Skipped | Skipping Test. Env variable MX_TEST is not set. Skipping the test | 2.639 | |
| test_with_vxlan_encap_agent_restart[sanity,serial] | Failure | Details
Traceback (most recent call last):
testtools.testresult.real._StringException: Traceback (most recent call last):
File "/contrail-test/tcutils/wrappers.py", line 176, in wrapper
raise TestFailed("\n ".join(errmsg))
tcutils.cores.TestFailed: Test failed: AssertionError
Python 3.9.25: /usr/bin/python3
Mon Oct 5 05:22:44 2026
A problem occurred in a Python script. Here is the sequence of
function calls leading up to the error, in the order they occurred.
/contrail-test/tcutils/wrappers.py in wrapper(self=<serial_scripts.evpn.test_evpn.TestEvpnCasesRest...p_agent_restart[sanity,serial] id=0x7f8f35dac100>, *args=(), **kwargs={})
78 log.info('Initial checks done. Running the testcase now')
79 log.info('')
80 result = function(self, *args, **kwargs)
81 if self.inputs.upgrade:
82 pid = os.getpid()
result = None
function = <function TestEvpnCasesRestart.test_with_vxlan_encap_agent_restart>
self = <serial_scripts.evpn.test_evpn.TestEvpnCasesRest...p_agent_restart[sanity,serial] id=0x7f8f35dac100>
args = ()
kwargs = {}
/contrail-test/serial_scripts/evpn/test_evpn.py in test_with_vxlan_encap_agent_restart(self=<serial_scripts.evpn.test_evpn.TestEvpnCasesRest...p_agent_restart[sanity,serial] id=0x7f8f35dac100>)
353 Maintainer: chhandak@juniper.net
354 '''
355 verdict=self.verify_epvn_with_agent_restart(encap='vxlan')
356 if not verdict:
357 print("collect logs for bug 1737030")
verdict undefined
self = <serial_scripts.evpn.test_evpn.TestEvpnCasesRest...p_agent_restart[sanity,serial] id=0x7f8f35dac100>
self.verify_epvn_with_agent_restart = <bound method VerifyEvpnCases.verify_epvn_with_a..._agent_restart[sanity,serial] id=0x7f8f35dac100>>
encap undefined
/contrail-test/serial_scripts/evpn/verify.py in verify_epvn_with_agent_restart(self=<serial_scripts.evpn.test_evpn.TestEvpnCasesRest...p_agent_restart[sanity,serial] id=0x7f8f35dac100>, encap='vxlan')
1998 assert vn1_fixture.verify_on_setup()
1999 assert vn1_vm1_fixture.verify_on_setup()
2000 assert vn1_vm2_fixture.verify_on_setup()
2001 assert vn1_vm1_fixture.wait_till_vm_is_up()
2002 assert vn1_vm2_fixture.wait_till_vm_is_up()
vn1_vm2_fixture = <VMFixture: EVPN_VN1_VM2>
vn1_vm2_fixture.verify_on_setup = <bound method VMFixture.verify_on_setup of <VMFixture: EVPN_VN1_VM2>>
AssertionError:
__cause__ = None
__class__ = <class 'AssertionError'>
__context__ = None
__delattr__ = <method-wrapper '__delattr__' of AssertionError object>
__dict__ = {}
__dir__ = <built-in method __dir__ of AssertionError object>
__doc__ = 'Assertion failed.'
__eq__ = <method-wrapper '__eq__' of AssertionError object>
__format__ = <built-in method __format__ of AssertionError object>
__ge__ = <method-wrapper '__ge__' of AssertionError object>
__getattribute__ = <method-wrapper '__getattribute__' of AssertionError object>
__gt__ = <method-wrapper '__gt__' of AssertionError object>
__hash__ = <method-wrapper '__hash__' of AssertionError object>
__init__ = <method-wrapper '__init__' of AssertionError object>
__init_subclass__ = <built-in method __init_subclass__ of type object>
__le__ = <method-wrapper '__le__' of AssertionError object>
__lt__ = <method-wrapper '__lt__' of AssertionError object>
__ne__ = <method-wrapper '__ne__' of AssertionError object>
__new__ = <built-in method __new__ of type object>
__reduce__ = <built-in method __reduce__ of AssertionError object>
__reduce_ex__ = <built-in method __reduce_ex__ of AssertionError object>
__repr__ = <method-wrapper '__repr__' of AssertionError object>
__setattr__ = <method-wrapper '__setattr__' of AssertionError object>
__setstate__ = <built-in method __setstate__ of AssertionError object>
__sizeof__ = <built-in method __sizeof__ of AssertionError object>
__str__ = <method-wrapper '__str__' of AssertionError object>
__subclasshook__ = <built-in method __subclasshook__ of type object>
__suppress_context__ = False
__traceback__ = <traceback object>
args = ()
with_traceback = <built-in method with_traceback of AssertionError object>
The above is a description of an error in a Python program. Here is
the original traceback:
Traceback (most recent call last):
File "/contrail-test/tcutils/wrappers.py", line 80, in wrapper
result = function(self, *args, **kwargs)
File "/contrail-test/serial_scripts/evpn/test_evpn.py", line 355, in test_with_vxlan_encap_agent_restart
verdict=self.verify_epvn_with_agent_restart(encap='vxlan')
File "/contrail-test/serial_scripts/evpn/verify.py", line 2000, in verify_epvn_with_agent_restart
assert vn1_vm2_fixture.verify_on_setup()
AssertionError
| 249.991 |
Log File
|
| test_change_of_rt_in_vn[mx_test,sanity,serial] | Skipped | Skipping Test. Env variable MX_GW_TEST is not set | 2.669 | |
| test_gw_less_fwd_single_vn_ip_fab[cb_sanity,sanity] | Skipped | Skipping Test. Fabric gateway is required to run the test | 2.654 | |
| test_check_per_peer_on_control[sanity] | Success | | 233.944 | |
| test_create_md5_on_control[sanity] | Success | | 234.918 | |
| test_perms2_global_share[ci_sanity,sanity] | Success | | 76.295 | |
| test_perms2_owner[ci_sanity,sanity,suite1] | Success | | 20.522 | |
| test_rbac_acl_different_roles[ci_sanity,sanity,suite1] | Success | | 21.757 | |
| test_rbac_create_delete_vm[sanity,suite1] | Success | | 70.232 | |
| test_contrail_status[cb_sanity,ci_sanity,dev_sanity_dpdk,sanity] | Success | | 3.686 | |
| test_control_node_switchover[cb_sanity,sanity] | Failure | Details
Traceback (most recent call last):
testtools.testresult.real._StringException: Traceback (most recent call last):
File "/contrail-test/tcutils/wrappers.py", line 176, in wrapper
raise TestFailed("\n ".join(errmsg))
tcutils.cores.TestFailed: Test failed: AssertionError
Python 3.9.25: /usr/bin/python3
Mon Oct 5 05:38:51 2026
A problem occurred in a Python script. Here is the sequence of
function calls leading up to the error, in the order they occurred.
/contrail-test/tcutils/wrappers.py in wrapper(self=<serial_scripts.vm_regression.test_vm_serial.Tes...e_switchover[cb_sanity,sanity] id=0x7f8f35602d60>, *args=(), **kwargs={})
78 log.info('Initial checks done. Running the testcase now')
79 log.info('')
80 result = function(self, *args, **kwargs)
81 if self.inputs.upgrade:
82 pid = os.getpid()
result = None
function = <function TestBasicVMVN0.test_control_node_switchover>
self = <serial_scripts.vm_regression.test_vm_serial.Tes...e_switchover[cb_sanity,sanity] id=0x7f8f35602d60>
args = ()
kwargs = {}
/contrail-test/serial_scripts/vm_regression/test_vm_serial.py in test_control_node_switchover(self=<serial_scripts.vm_regression.test_vm_serial.Tes...e_switchover[cb_sanity,sanity] id=0x7f8f35602d60>)
636 vm2_fixture = self.create_vm(vn1_fixture, vn1_vm2_name)
637 assert vm1_fixture.wait_till_vm_is_up()
638 assert vm2_fixture.wait_till_vm_is_up()
639 assert vm1_fixture.ping_to_ip(vm2_fixture.vm_ip)
640 assert vm2_fixture.ping_to_ip(vm1_fixture.vm_ip)
vm2_fixture = <VMFixture: ctest-vn1_vm2-76720314>
vm2_fixture.wait_till_vm_is_up = <bound method VMFixture.wait_till_vm_is_up of <VMFixture: ctest-vn1_vm2-76720314>>
AssertionError:
__cause__ = None
__class__ = <class 'AssertionError'>
__context__ = None
__delattr__ = <method-wrapper '__delattr__' of AssertionError object>
__dict__ = {}
__dir__ = <built-in method __dir__ of AssertionError object>
__doc__ = 'Assertion failed.'
__eq__ = <method-wrapper '__eq__' of AssertionError object>
__format__ = <built-in method __format__ of AssertionError object>
__ge__ = <method-wrapper '__ge__' of AssertionError object>
__getattribute__ = <method-wrapper '__getattribute__' of AssertionError object>
__gt__ = <method-wrapper '__gt__' of AssertionError object>
__hash__ = <method-wrapper '__hash__' of AssertionError object>
__init__ = <method-wrapper '__init__' of AssertionError object>
__init_subclass__ = <built-in method __init_subclass__ of type object>
__le__ = <method-wrapper '__le__' of AssertionError object>
__lt__ = <method-wrapper '__lt__' of AssertionError object>
__ne__ = <method-wrapper '__ne__' of AssertionError object>
__new__ = <built-in method __new__ of type object>
__reduce__ = <built-in method __reduce__ of AssertionError object>
__reduce_ex__ = <built-in method __reduce_ex__ of AssertionError object>
__repr__ = <method-wrapper '__repr__' of AssertionError object>
__setattr__ = <method-wrapper '__setattr__' of AssertionError object>
__setstate__ = <built-in method __setstate__ of AssertionError object>
__sizeof__ = <built-in method __sizeof__ of AssertionError object>
__str__ = <method-wrapper '__str__' of AssertionError object>
__subclasshook__ = <built-in method __subclasshook__ of type object>
__suppress_context__ = False
__traceback__ = <traceback object>
args = ()
with_traceback = <built-in method with_traceback of AssertionError object>
The above is a description of an error in a Python program. Here is
the original traceback:
Traceback (most recent call last):
File "/contrail-test/tcutils/wrappers.py", line 80, in wrapper
result = function(self, *args, **kwargs)
File "/contrail-test/serial_scripts/vm_regression/test_vm_serial.py", line 638, in test_control_node_switchover
assert vm2_fixture.wait_till_vm_is_up()
AssertionError
| 242.165 |
Log File
|
| test_process_restart_in_policy_between_vns[cb_sanity,sanity] | Failure | Details
Traceback (most recent call last):
testtools.testresult.real._StringException: Traceback (most recent call last):
File "/contrail-test/tcutils/wrappers.py", line 176, in wrapper
raise TestFailed("\n ".join(errmsg))
tcutils.cores.TestFailed: Test failed: AssertionError
Python 3.9.25: /usr/bin/python3
Mon Oct 5 05:42:53 2026
A problem occurred in a Python script. Here is the sequence of
function calls leading up to the error, in the order they occurred.
/contrail-test/tcutils/wrappers.py in wrapper(self=<serial_scripts.vm_regression.test_vm_serial.Tes..._between_vns[cb_sanity,sanity] id=0x7f8f35613520>, *args=(), **kwargs={})
78 log.info('Initial checks done. Running the testcase now')
79 log.info('')
80 result = function(self, *args, **kwargs)
81 if self.inputs.upgrade:
82 pid = os.getpid()
result = None
function = <function TestBasicVMVN0.test_process_restart_in_policy_between_vns>
self = <serial_scripts.vm_regression.test_vm_serial.Tes..._between_vns[cb_sanity,sanity] id=0x7f8f35613520>
args = ()
kwargs = {}
/contrail-test/serial_scripts/vm_regression/test_vm_serial.py in test_process_restart_in_policy_between_vns(self=<serial_scripts.vm_regression.test_vm_serial.Tes..._between_vns[cb_sanity,sanity] id=0x7f8f35613520>)
405 vm2_fixture = self.create_vm(vn2_fixture, vn2_vm1_name)
406 assert vm1_fixture.wait_till_vm_is_up()
407 assert vm2_fixture.wait_till_vm_is_up()
408 assert vm1_fixture.ping_with_certainty(vm2_fixture.vm_ip)
409
vm2_fixture = <VMFixture: ctest-vn2_vm1-30542495>
vm2_fixture.wait_till_vm_is_up = <bound method VMFixture.wait_till_vm_is_up of <VMFixture: ctest-vn2_vm1-30542495>>
AssertionError:
__cause__ = None
__class__ = <class 'AssertionError'>
__context__ = None
__delattr__ = <method-wrapper '__delattr__' of AssertionError object>
__dict__ = {}
__dir__ = <built-in method __dir__ of AssertionError object>
__doc__ = 'Assertion failed.'
__eq__ = <method-wrapper '__eq__' of AssertionError object>
__format__ = <built-in method __format__ of AssertionError object>
__ge__ = <method-wrapper '__ge__' of AssertionError object>
__getattribute__ = <method-wrapper '__getattribute__' of AssertionError object>
__gt__ = <method-wrapper '__gt__' of AssertionError object>
__hash__ = <method-wrapper '__hash__' of AssertionError object>
__init__ = <method-wrapper '__init__' of AssertionError object>
__init_subclass__ = <built-in method __init_subclass__ of type object>
__le__ = <method-wrapper '__le__' of AssertionError object>
__lt__ = <method-wrapper '__lt__' of AssertionError object>
__ne__ = <method-wrapper '__ne__' of AssertionError object>
__new__ = <built-in method __new__ of type object>
__reduce__ = <built-in method __reduce__ of AssertionError object>
__reduce_ex__ = <built-in method __reduce_ex__ of AssertionError object>
__repr__ = <method-wrapper '__repr__' of AssertionError object>
__setattr__ = <method-wrapper '__setattr__' of AssertionError object>
__setstate__ = <built-in method __setstate__ of AssertionError object>
__sizeof__ = <built-in method __sizeof__ of AssertionError object>
__str__ = <method-wrapper '__str__' of AssertionError object>
__subclasshook__ = <built-in method __subclasshook__ of type object>
__suppress_context__ = False
__traceback__ = <traceback object>
args = ()
with_traceback = <built-in method with_traceback of AssertionError object>
The above is a description of an error in a Python program. Here is
the original traceback:
Traceback (most recent call last):
File "/contrail-test/tcutils/wrappers.py", line 80, in wrapper
result = function(self, *args, **kwargs)
File "/contrail-test/serial_scripts/vm_regression/test_vm_serial.py", line 407, in test_process_restart_in_policy_between_vns
assert vm2_fixture.wait_till_vm_is_up()
AssertionError
| 241.272 |
Log File
|
| test_underlay_broadcast_traffic_handling[sanity] | Success | | 27.136 | |
| test_flow_action_drop_stats[dev_reg,sanity] | Failure | Details
Traceback (most recent call last):
testtools.testresult.real._StringException: Traceback (most recent call last):
File "/contrail-test/tcutils/wrappers.py", line 176, in wrapper
raise TestFailed("\n ".join(errmsg))
tcutils.cores.TestFailed: Test failed: AssertionError
Python 3.9.25: /usr/bin/python3
Mon Oct 5 05:49:19 2026
A problem occurred in a Python script. Here is the sequence of
function calls leading up to the error, in the order they occurred.
/contrail-test/tcutils/wrappers.py in wrapper(self=<serial_scripts.vrouter.test_drop_stats.TestDrop...ion_drop_stats[dev_reg,sanity] id=0x7f8f3561f610>, *args=(), **kwargs={})
78 log.info('Initial checks done. Running the testcase now')
79 log.info('')
80 result = function(self, *args, **kwargs)
81 if self.inputs.upgrade:
82 pid = os.getpid()
result = None
function = <function TestDropStats.test_flow_action_drop_stats>
self = <serial_scripts.vrouter.test_drop_stats.TestDrop...ion_drop_stats[dev_reg,sanity] id=0x7f8f3561f610>
args = ()
kwargs = {}
/contrail-test/serial_scripts/vrouter/test_drop_stats.py in test_flow_action_drop_stats(self=<serial_scripts.vrouter.test_drop_stats.TestDrop...ion_drop_stats[dev_reg,sanity] id=0x7f8f3561f610>)
36 raise self.skipTest("Skipping test case,this test needs atleast 2 compute nodes")
37
38 assert self.verify_flow_action_drop_stats()
39 return True
40 # end test_drop_stats
self = <serial_scripts.vrouter.test_drop_stats.TestDrop...ion_drop_stats[dev_reg,sanity] id=0x7f8f3561f610>
self.verify_flow_action_drop_stats = <bound method BaseDropStats.verify_flow_action_d...on_drop_stats[dev_reg,sanity] id=0x7f8f3561f610>>
/contrail-test/common/vrouter/base_drop_stats.py in verify_flow_action_drop_stats(self=<serial_scripts.vrouter.test_drop_stats.TestDrop...ion_drop_stats[dev_reg,sanity] id=0x7f8f3561f610>, drop_type='ds_flow_action_drop')
45 compute1 = compute_ips[1]
46 compute1_name = self.inputs.host_data[compute1]['name']
47 vm1_fixture, _, _, vm2_ip = self.create_verify_vn_vm(compute0_name, compute1_name, image_name)
48
49 tap = vm1_fixture.get_tap_intf_of_vm()[0]['name']
vm1_fixture undefined
_ undefined
vm2_ip undefined
self = <serial_scripts.vrouter.test_drop_stats.TestDrop...ion_drop_stats[dev_reg,sanity] id=0x7f8f3561f610>
self.create_verify_vn_vm = <bound method BaseDropStats.create_verify_vn_vm ...on_drop_stats[dev_reg,sanity] id=0x7f8f3561f610>>
compute0_name = 'an-jenkins-deploy-platform-ansible-os-6343-1'
compute1_name = 'an-jenkins-deploy-platform-ansible-os-6343-2'
image_name = 'cirros'
/contrail-test/common/vrouter/base_drop_stats.py in create_verify_vn_vm(self=<serial_scripts.vrouter.test_drop_stats.TestDrop...ion_drop_stats[dev_reg,sanity] id=0x7f8f3561f610>, compute0_name='an-jenkins-deploy-platform-ansible-os-6343-1', compute1_name='an-jenkins-deploy-platform-ansible-os-6343-2', image_name='cirros')
129 vm2_fixture.wait_till_vm_is_up()
130 assert vm1_fixture.verify_on_setup()
131 assert vm2_fixture.verify_on_setup()
132 vm1_ip = vm1_fixture.get_vm_ips(vn1_fq_name)[0]
133 vm2_ip = vm2_fixture.get_vm_ips(vn2_fq_name)[0]
vm2_fixture = <VMFixture: ctest-vm2-37901184>
vm2_fixture.verify_on_setup = <bound method VMFixture.verify_on_setup of <VMFixture: ctest-vm2-37901184>>
AssertionError:
__cause__ = None
__class__ = <class 'AssertionError'>
__context__ = None
__delattr__ = <method-wrapper '__delattr__' of AssertionError object>
__dict__ = {}
__dir__ = <built-in method __dir__ of AssertionError object>
__doc__ = 'Assertion failed.'
__eq__ = <method-wrapper '__eq__' of AssertionError object>
__format__ = <built-in method __format__ of AssertionError object>
__ge__ = <method-wrapper '__ge__' of AssertionError object>
__getattribute__ = <method-wrapper '__getattribute__' of AssertionError object>
__gt__ = <method-wrapper '__gt__' of AssertionError object>
__hash__ = <method-wrapper '__hash__' of AssertionError object>
__init__ = <method-wrapper '__init__' of AssertionError object>
__init_subclass__ = <built-in method __init_subclass__ of type object>
__le__ = <method-wrapper '__le__' of AssertionError object>
__lt__ = <method-wrapper '__lt__' of AssertionError object>
__ne__ = <method-wrapper '__ne__' of AssertionError object>
__new__ = <built-in method __new__ of type object>
__reduce__ = <built-in method __reduce__ of AssertionError object>
__reduce_ex__ = <built-in method __reduce_ex__ of AssertionError object>
__repr__ = <method-wrapper '__repr__' of AssertionError object>
__setattr__ = <method-wrapper '__setattr__' of AssertionError object>
__setstate__ = <built-in method __setstate__ of AssertionError object>
__sizeof__ = <built-in method __sizeof__ of AssertionError object>
__str__ = <method-wrapper '__str__' of AssertionError object>
__subclasshook__ = <built-in method __subclasshook__ of type object>
__suppress_context__ = False
__traceback__ = <traceback object>
args = ()
with_traceback = <built-in method with_traceback of AssertionError object>
The above is a description of an error in a Python program. Here is
the original traceback:
Traceback (most recent call last):
File "/contrail-test/tcutils/wrappers.py", line 80, in wrapper
result = function(self, *args, **kwargs)
File "/contrail-test/serial_scripts/vrouter/test_drop_stats.py", line 38, in test_flow_action_drop_stats
assert self.verify_flow_action_drop_stats()
File "/contrail-test/common/vrouter/base_drop_stats.py", line 47, in verify_flow_action_drop_stats
vm1_fixture, _, _, vm2_ip = self.create_verify_vn_vm(compute0_name, compute1_name, image_name)
File "/contrail-test/common/vrouter/base_drop_stats.py", line 131, in create_verify_vn_vm
assert vm2_fixture.verify_on_setup()
AssertionError
| 373.677 |
Log File
|
| test_fat_flow_aggr_dest_udp_inter_vn_inter_node[dev_reg,sanity] | Failure | Details
Traceback (most recent call last):
testtools.testresult.real._StringException: Traceback (most recent call last):
File "/contrail-test/tcutils/wrappers.py", line 176, in wrapper
raise TestFailed("\n ".join(errmsg))
tcutils.cores.TestFailed: Test failed: TestFailed
Python 3.9.25: /usr/bin/python3
Mon Oct 5 05:55:40 2026
A problem occurred in a Python script. Here is the sequence of
function calls leading up to the error, in the order they occurred.
/contrail-test/tcutils/wrappers.py in wrapper(self=<serial_scripts.vrouter.test_fat_flow_aggr_seria..._vn_inter_node[dev_reg,sanity] id=0x7f8f3561f9d0>, *args=(), **kwargs={})
78 log.info('Initial checks done. Running the testcase now')
79 log.info('')
80 result = function(self, *args, **kwargs)
81 if self.inputs.upgrade:
82 pid = os.getpid()
result = None
function = <function FatFlowAggrIpv6Serial.test_fat_flow_aggr_dest_udp_inter_vn_inter_node>
self = <serial_scripts.vrouter.test_fat_flow_aggr_seria..._vn_inter_node[dev_reg,sanity] id=0x7f8f3561f9d0>
args = ()
kwargs = {}
/contrail-test/serial_scripts/vrouter/test_fat_flow_aggr_serial.py in test_fat_flow_aggr_dest_udp_inter_vn_inter_node(self=<serial_scripts.vrouter.test_fat_flow_aggr_seria..._vn_inter_node[dev_reg,sanity] id=0x7f8f3561f9d0>)
91
92 """
93 self.inputs.set_af('dual')
94 super(FatFlowAggrIpv6Serial, self).test_fat_flow_aggr_dest_udp_inter_vn_inter_node()
95
builtinsuper = <class 'super'>
global FatFlowAggrIpv6Serial = <class 'serial_scripts.vrouter.test_fat_flow_aggr_serial.FatFlowAggrIpv6Serial'>
self = <serial_scripts.vrouter.test_fat_flow_aggr_seria..._vn_inter_node[dev_reg,sanity] id=0x7f8f3561f9d0>
).test_fat_flow_aggr_dest_udp_inter_vn_inter_node = <bound method FatFlowAggrIpv6Serial.test_fat_flo...vn_inter_node[dev_reg,sanity] id=0x7f8f3561f9d0>>
/contrail-test/tcutils/wrappers.py in wrapper(self=<serial_scripts.vrouter.test_fat_flow_aggr_seria..._vn_inter_node[dev_reg,sanity] id=0x7f8f3561f9d0>, *args=(), **kwargs={})
174 if 'ci_image' in list(os.environ.keys()):
175 os.environ['stop_execution_flag'] = 'set'
176 raise TestFailed("\n ".join(errmsg))
177 elif testskip:
178 log.info('')
global TestFailed = <class 'tcutils.cores.TestFailed'>
"\n ".join undefined
errmsg = ['Test failed: AssertionError\nPython 3.9.25: /usr/...ert server.wait_till_vm_is_up()\nAssertionError\n\n\n']
TestFailed: Test failed: AssertionError
Python 3.9.25: /usr/bin/python3
Mon Oct 5 05:55:33 2026
A problem occurred in a Python script. Here is the sequence of
function calls leading up to the error, in the order they occurred.
/contrail-test/tcutils/wrappers.py in wrapper(self=<serial_scripts.vrouter.test_fat_flow_aggr_seria..._vn_inter_node[dev_reg,sanity] id=0x7f8f3561f9d0>, *args=(), **kwargs={})
78 log.info('Initial checks done. Running the testcase now')
79 log.info('')
80 result = function(self, *args, **kwargs)
81 if self.inputs.upgrade:
82 pid = os.getpid()
result = None
function = <function FatFlowAggrSerial.test_fat_flow_aggr_dest_udp_inter_vn_inter_node>
self = <serial_scripts.vrouter.test_fat_flow_aggr_seria..._vn_inter_node[dev_reg,sanity] id=0x7f8f3561f9d0>
args = ()
kwargs = {}
/contrail-test/serial_scripts/vrouter/test_fat_flow_aggr_serial.py in test_fat_flow_aggr_dest_udp_inter_vn_inter_node(self=<serial_scripts.vrouter.test_fat_flow_aggr_seria..._vn_inter_node[dev_reg,sanity] id=0x7f8f3561f9d0>)
56 policy_deny = False
57 vn_policy = True
58 self.fat_flow_with_prefix_aggr(prefix_length=prefix_length,
59 inter_node=inter_node,inter_vn=inter_vn, proto=proto,
60 port=port, vn_policy=vn_policy, policy_deny=policy_deny,
self = <serial_scripts.vrouter.test_fat_flow_aggr_seria..._vn_inter_node[dev_reg,sanity] id=0x7f8f3561f9d0>
self.fat_flow_with_prefix_aggr = <bound method BaseVrouterTest.fat_flow_with_pref...vn_inter_node[dev_reg,sanity] id=0x7f8f3561f9d0>>
prefix_length = 29
inter_node = True
inter_vn = True
proto = 'udp'
port = 55
vn_policy = True
policy_deny = False
dual undefined
ipv6 = True
prefix_length6 = 125
only_v6 = True
/contrail-test/common/vrouter/base.py in fat_flow_with_prefix_aggr(self=<serial_scripts.vrouter.test_fat_flow_aggr_seria..._vn_inter_node[dev_reg,sanity] id=0x7f8f3561f9d0>, prefix_length=29, prefix_length6=125, inter_node=True, inter_vn=True, dual=True, traffic_recvr=False, unidirectional_traffic=True, ignore_address=None, proto='udp', port=55, portv6=56, svc_chain=False, only_v6=True, af='v4', icmp_error=False, hc=None, vn_policy=True, policy_deny=False, svm_inter_node=False, resources=True, scale=False)
422 node_name=server_compute)
423 for server in self.server_fixtures:
424 assert server.wait_till_vm_is_up()
425
426 server_fixtures = self.server_fixtures
server = <VMFixture: ctest-FatFlowAggrIpv6Serial-78426072-61459017>
server.wait_till_vm_is_up = <bound method VMFixture.wait_till_vm_is_up of <V...: ctest-FatFlowAggrIpv6Serial-78426072-61459017>>
AssertionError:
__cause__ = None
__class__ = <class 'AssertionError'>
__context__ = None
__delattr__ = <method-wrapper '__delattr__' of AssertionError object>
__dict__ = {}
__dir__ = <built-in method __dir__ of AssertionError object>
__doc__ = 'Assertion failed.'
__eq__ = <method-wrapper '__eq__' of AssertionError object>
__format__ = <built-in method __format__ of AssertionError object>
__ge__ = <method-wrapper '__ge__' of AssertionError object>
__getattribute__ = <method-wrapper '__getattribute__' of AssertionError object>
__gt__ = <method-wrapper '__gt__' of AssertionError object>
__hash__ = <method-wrapper '__hash__' of AssertionError object>
__init__ = <method-wrapper '__init__' of AssertionError object>
__init_subclass__ = <built-in method __init_subclass__ of type object>
__le__ = <method-wrapper '__le__' of AssertionError object>
__lt__ = <method-wrapper '__lt__' of AssertionError object>
__ne__ = <method-wrapper '__ne__' of AssertionError object>
__new__ = <built-in method __new__ of type object>
__reduce__ = <built-in method __reduce__ of AssertionError object>
__reduce_ex__ = <built-in method __reduce_ex__ of AssertionError object>
__repr__ = <method-wrapper '__repr__' of AssertionError object>
__setattr__ = <method-wrapper '__setattr__' of AssertionError object>
__setstate__ = <built-in method __setstate__ of AssertionError object>
__sizeof__ = <built-in method __sizeof__ of AssertionError object>
__str__ = <method-wrapper '__str__' of AssertionError object>
__subclasshook__ = <built-in method __subclasshook__ of type object>
__suppress_context__ = False
__traceback__ = <traceback object>
args = ()
with_traceback = <built-in method with_traceback of AssertionError object>
The above is a description of an error in a Python program. Here is
the original traceback:
Traceback (most recent call last):
File "/contrail-test/tcutils/wrappers.py", line 80, in wrapper
result = function(self, *args, **kwargs)
File "/contrail-test/serial_scripts/vrouter/test_fat_flow_aggr_serial.py", line 58, in test_fat_flow_aggr_dest_udp_inter_vn_inter_node
self.fat_flow_with_prefix_aggr(prefix_length=prefix_length,
File "/contrail-test/common/vrouter/base.py", line 424, in fat_flow_with_prefix_aggr
assert server.wait_till_vm_is_up()
AssertionError
__cause__ = None
__class__ = <class 'tcutils.cores.TestFailed'>
__context__ = None
__delattr__ = <method-wrapper '__delattr__' of TestFailed object>
__dict__ = {}
__dir__ = <built-in method __dir__ of TestFailed object>
__doc__ = None
__eq__ = <method-wrapper '__eq__' of TestFailed object>
__format__ = <built-in method __format__ of TestFailed object>
__ge__ = <method-wrapper '__ge__' of TestFailed object>
__getattribute__ = <method-wrapper '__getattribute__' of TestFailed object>
__gt__ = <method-wrapper '__gt__' of TestFailed object>
__hash__ = <method-wrapper '__hash__' of TestFailed object>
__init__ = <method-wrapper '__init__' of TestFailed object>
__init_subclass__ = <built-in method __init_subclass__ of type object>
__le__ = <method-wrapper '__le__' of TestFailed object>
__lt__ = <method-wrapper '__lt__' of TestFailed object>
__module__ = 'tcutils.cores'
__ne__ = <method-wrapper '__ne__' of TestFailed object>
__new__ = <built-in method __new__ of type object>
__reduce__ = <built-in method __reduce__ of TestFailed object>
__reduce_ex__ = <built-in method __reduce_ex__ of TestFailed object>
__repr__ = <method-wrapper '__repr__' of TestFailed object>
__setattr__ = <method-wrapper '__setattr__' of TestFailed object>
__setstate__ = <built-in method __setstate__ of TestFailed object>
__sizeof__ = <built-in method __sizeof__ of TestFailed object>
__str__ = <method-wrapper '__str__' of TestFailed object>
__subclasshook__ = <built-in method __subclasshook__ of type object>
__suppress_context__ = False
__traceback__ = <traceback object>
__weakref__ = None
args = ('Test failed: AssertionError\nPython 3.9.25: /usr/...ert server.wait_till_vm_is_up()\nAssertionError\n\n\n',)
with_traceback = <built-in method with_traceback of TestFailed object>
The above is a description of an error in a Python program. Here is
the original traceback:
Traceback (most recent call last):
File "/contrail-test/tcutils/wrappers.py", line 80, in wrapper
result = function(self, *args, **kwargs)
File "/contrail-test/serial_scripts/vrouter/test_fat_flow_aggr_serial.py", line 94, in test_fat_flow_aggr_dest_udp_inter_vn_inter_node
super(FatFlowAggrIpv6Serial, self).test_fat_flow_aggr_dest_udp_inter_vn_inter_node()
File "/contrail-test/tcutils/wrappers.py", line 176, in wrapper
raise TestFailed("\n ".join(errmsg))
tcutils.cores.TestFailed: Test failed: AssertionError
Python 3.9.25: /usr/bin/python3
Mon Oct 5 05:55:33 2026
A problem occurred in a Python script. Here is the sequence of
function calls leading up to the error, in the order they occurred.
/contrail-test/tcutils/wrappers.py in wrapper(self=<serial_scripts.vrouter.test_fat_flow_aggr_seria..._vn_inter_node[dev_reg,sanity] id=0x7f8f3561f9d0>, *args=(), **kwargs={})
78 log.info('Initial checks done. Running the testcase now')
79 log.info('')
80 result = function(self, *args, **kwargs)
81 if self.inputs.upgrade:
82 pid = os.getpid()
result = None
function = <function FatFlowAggrSerial.test_fat_flow_aggr_dest_udp_inter_vn_inter_node>
self = <serial_scripts.vrouter.test_fat_flow_aggr_seria..._vn_inter_node[dev_reg,sanity] id=0x7f8f3561f9d0>
args = ()
kwargs = {}
/contrail-test/serial_scripts/vrouter/test_fat_flow_aggr_serial.py in test_fat_flow_aggr_dest_udp_inter_vn_inter_node(self=<serial_scripts.vrouter.test_fat_flow_aggr_seria..._vn_inter_node[dev_reg,sanity] id=0x7f8f3561f9d0>)
56 policy_deny = False
57 vn_policy = True
58 self.fat_flow_with_prefix_aggr(prefix_length=prefix_length,
59 inter_node=inter_node,inter_vn=inter_vn, proto=proto,
60 port=port, vn_policy=vn_policy, policy_deny=policy_deny,
self = <serial_scripts.vrouter.test_fat_flow_aggr_seria..._vn_inter_node[dev_reg,sanity] id=0x7f8f3561f9d0>
self.fat_flow_with_prefix_aggr = <bound method BaseVrouterTest.fat_flow_with_pref...vn_inter_node[dev_reg,sanity] id=0x7f8f3561f9d0>>
prefix_length = 29
inter_node = True
inter_vn = True
proto = 'udp'
port = 55
vn_policy = True
policy_deny = False
dual undefined
ipv6 = True
prefix_length6 = 125
only_v6 = True
/contrail-test/common/vrouter/base.py in fat_flow_with_prefix_aggr(self=<serial_scripts.vrouter.test_fat_flow_aggr_seria..._vn_inter_node[dev_reg,sanity] id=0x7f8f3561f9d0>, prefix_length=29, prefix_length6=125, inter_node=True, inter_vn=True, dual=True, traffic_recvr=False, unidirectional_traffic=True, ignore_address=None, proto='udp', port=55, portv6=56, svc_chain=False, only_v6=True, af='v4', icmp_error=False, hc=None, vn_policy=True, policy_deny=False, svm_inter_node=False, resources=True, scale=False)
422 node_name=server_compute)
423 for server in self.server_fixtures:
424 assert server.wait_till_vm_is_up()
425
426 server_fixtures = self.server_fixtures
server = <VMFixture: ctest-FatFlowAggrIpv6Serial-78426072-61459017>
server.wait_till_vm_is_up = <bound method VMFixture.wait_till_vm_is_up of <V...: ctest-FatFlowAggrIpv6Serial-78426072-61459017>>
AssertionError:
__cause__ = None
__class__ = <class 'AssertionError'>
__context__ = None
__delattr__ = <method-wrapper '__delattr__' of AssertionError object>
__dict__ = {}
__dir__ = <built-in method __dir__ of AssertionError object>
__doc__ = 'Assertion failed.'
__eq__ = <method-wrapper '__eq__' of AssertionError object>
__format__ = <built-in method __format__ of AssertionError object>
__ge__ = <method-wrapper '__ge__' of AssertionError object>
__getattribute__ = <method-wrapper '__getattribute__' of AssertionError object>
__gt__ = <method-wrapper '__gt__' of AssertionError object>
__hash__ = <method-wrapper '__hash__' of AssertionError object>
__init__ = <method-wrapper '__init__' of AssertionError object>
__init_subclass__ = <built-in method __init_subclass__ of type object>
__le__ = <method-wrapper '__le__' of AssertionError object>
__lt__ = <method-wrapper '__lt__' of AssertionError object>
__ne__ = <method-wrapper '__ne__' of AssertionError object>
__new__ = <built-in method __new__ of type object>
__reduce__ = <built-in method __reduce__ of AssertionError object>
__reduce_ex__ = <built-in method __reduce_ex__ of AssertionError object>
__repr__ = <method-wrapper '__repr__' of AssertionError object>
__setattr__ = <method-wrapper '__setattr__' of AssertionError object>
__setstate__ = <built-in method __setstate__ of AssertionError object>
__sizeof__ = <built-in method __sizeof__ of AssertionError object>
__str__ = <method-wrapper '__str__' of AssertionError object>
__subclasshook__ = <built-in method __subclasshook__ of type object>
__suppress_context__ = False
__traceback__ = <traceback object>
args = ()
with_traceback = <built-in method with_traceback of AssertionError object>
The above is a description of an error in a Python program. Here is
the original traceback:
Traceback (most recent call last):
File "/contrail-test/tcutils/wrappers.py", line 80, in wrapper
result = function(self, *args, **kwargs)
File "/contrail-test/serial_scripts/vrouter/test_fat_flow_aggr_serial.py", line 58, in test_fat_flow_aggr_dest_udp_inter_vn_inter_node
self.fat_flow_with_prefix_aggr(prefix_length=prefix_length,
File "/contrail-test/common/vrouter/base.py", line 424, in fat_flow_with_prefix_aggr
assert server.wait_till_vm_is_up()
AssertionError
| 352.981 |
Log File
|
| test_fat_flow_intra_vn_inter_node[cb_sanity,sanity] | Failure | Details
Traceback (most recent call last):
testtools.testresult.real._StringException: Traceback (most recent call last):
File "/contrail-test/serial_scripts/vrouter/test_fat_flow_serial.py", line 600, in test_fat_flow_intra_vn_inter_node
super(FatFlowSerialIpv6, self).test_fat_flow_intra_vn_inter_node()
File "/contrail-test/tcutils/wrappers.py", line 176, in wrapper
raise TestFailed("\n ".join(errmsg))
tcutils.cores.TestFailed: Test failed: AssertionError
Python 3.9.25: /usr/bin/python3
Mon Oct 5 06:00:43 2026
A problem occurred in a Python script. Here is the sequence of
function calls leading up to the error, in the order they occurred.
/contrail-test/tcutils/wrappers.py in wrapper(self=<serial_scripts.vrouter.test_fat_flow_serial.Fat...n_inter_node[cb_sanity,sanity] id=0x7f8f355b36a0>, *args=(), **kwargs={})
78 log.info('Initial checks done. Running the testcase now')
79 log.info('')
80 result = function(self, *args, **kwargs)
81 if self.inputs.upgrade:
82 pid = os.getpid()
result = None
function = <function FatFlowSerial.test_fat_flow_intra_vn_inter_node>
self = <serial_scripts.vrouter.test_fat_flow_serial.Fat...n_inter_node[cb_sanity,sanity] id=0x7f8f355b36a0>
args = ()
kwargs = {}
/contrail-test/serial_scripts/vrouter/test_fat_flow_serial.py in test_fat_flow_intra_vn_inter_node(self=<serial_scripts.vrouter.test_fat_flow_serial.Fat...n_inter_node[cb_sanity,sanity] id=0x7f8f355b36a0>)
43 node_name=compute_hosts[1])
44 self.verify_vms(client_fixtures)
45 self.verify_vms(server_fixtures)
46
47 #Configure Fat flow on server VM
self = <serial_scripts.vrouter.test_fat_flow_serial.Fat...n_inter_node[cb_sanity,sanity] id=0x7f8f355b36a0>
self.verify_vms = <bound method BaseVrouterTest.verify_vms of <ser..._inter_node[cb_sanity,sanity] id=0x7f8f355b36a0>>
server_fixtures = [<VMFixture: ctest-FatFlowSerialIpv6-40853079-45089725>]
/contrail-test/common/vrouter/base.py in verify_vms(self=<serial_scripts.vrouter.test_fat_flow_serial.Fat...n_inter_node[cb_sanity,sanity] id=0x7f8f355b36a0>, vm_fixtures=[<VMFixture: ctest-FatFlowSerialIpv6-40853079-45089725>])
198 def verify_vms(self, vm_fixtures):
199 for vm_fixture in vm_fixtures:
200 assert vm_fixture.wait_till_vm_is_up()
201
202 def add_static_routes_on_vms(self,prefix, vm_fixtures, ip=None):
vm_fixture = <VMFixture: ctest-FatFlowSerialIpv6-40853079-45089725>
vm_fixture.wait_till_vm_is_up = <bound method VMFixture.wait_till_vm_is_up of <V...ture: ctest-FatFlowSerialIpv6-40853079-45089725>>
AssertionError:
__cause__ = None
__class__ = <class 'AssertionError'>
__context__ = None
__delattr__ = <method-wrapper '__delattr__' of AssertionError object>
__dict__ = {}
__dir__ = <built-in method __dir__ of AssertionError object>
__doc__ = 'Assertion failed.'
__eq__ = <method-wrapper '__eq__' of AssertionError object>
__format__ = <built-in method __format__ of AssertionError object>
__ge__ = <method-wrapper '__ge__' of AssertionError object>
__getattribute__ = <method-wrapper '__getattribute__' of AssertionError object>
__gt__ = <method-wrapper '__gt__' of AssertionError object>
__hash__ = <method-wrapper '__hash__' of AssertionError object>
__init__ = <method-wrapper '__init__' of AssertionError object>
__init_subclass__ = <built-in method __init_subclass__ of type object>
__le__ = <method-wrapper '__le__' of AssertionError object>
__lt__ = <method-wrapper '__lt__' of AssertionError object>
__ne__ = <method-wrapper '__ne__' of AssertionError object>
__new__ = <built-in method __new__ of type object>
__reduce__ = <built-in method __reduce__ of AssertionError object>
__reduce_ex__ = <built-in method __reduce_ex__ of AssertionError object>
__repr__ = <method-wrapper '__repr__' of AssertionError object>
__setattr__ = <method-wrapper '__setattr__' of AssertionError object>
__setstate__ = <built-in method __setstate__ of AssertionError object>
__sizeof__ = <built-in method __sizeof__ of AssertionError object>
__str__ = <method-wrapper '__str__' of AssertionError object>
__subclasshook__ = <built-in method __subclasshook__ of type object>
__suppress_context__ = False
__traceback__ = <traceback object>
args = ()
with_traceback = <built-in method with_traceback of AssertionError object>
The above is a description of an error in a Python program. Here is
the original traceback:
Traceback (most recent call last):
File "/contrail-test/tcutils/wrappers.py", line 80, in wrapper
result = function(self, *args, **kwargs)
File "/contrail-test/serial_scripts/vrouter/test_fat_flow_serial.py", line 45, in test_fat_flow_intra_vn_inter_node
self.verify_vms(server_fixtures)
File "/contrail-test/common/vrouter/base.py", line 200, in verify_vms
assert vm_fixture.wait_till_vm_is_up()
AssertionError
| 304.329 |
Log File
|
| test_precedence_xmpp_auth[sanity] | Skipped | Xmpp auth should be set before running tests | 2.649 | |
| test_undo_xmpp_auth[sanity] | Skipped | Xmpp auth should be set before running tests | 2.669 | |