<?xml version="1.0" encoding="UTF-8" ?>
<testsuites>
  <testsuite errors="0" failures="16" id="0" name="" package="" skipped="32" tests="82" time="7861.882">
    <testcase classname="scripts.RR.test_rr.TestBasicRR" name="test_basic_RR[sanity]" time="1.560">
      <skipped>Skipping Test. Env variable MX_GW_TEST is not set. Skipping the test</skipped>

    </testcase>

    <testcase classname="scripts.RR.test_rr.TestBasicRR" name="test_create_vm_after_RR_set[sanity]" time="1.376">
      <skipped>Skipping Test. Env variable MX_GW_TEST is not set. Skipping the test</skipped>

    </testcase>

    <testcase classname="scripts.analytics.test_analytics.AnalyticsTestSanity" name="test_contrail_status[cb_sanity,ci_sanity,dev_sanity_dpdk,sanity]" time="2.056" />

    <testcase classname="scripts.analytics.test_analytics.AnalyticsTestSanity3" name="test_db_nodemgr_status[dev_sanity_dpdk,sanity]" time="1.999" />

    <testcase classname="scripts.analytics.test_analytics.AnalyticsTestSanity3" name="test_verify_generator_collector_connections[dev_sanity_dpdk,sanity]" time="4.035" />

    <testcase classname="scripts.analytics.test_analytics.AnalyticsTestSanity3" name="test_verify_generator_connections_to_collector_node[dev_sanity_dpdk,sanity]" time="2.325" />

    <testcase classname="scripts.analytics.test_analytics.AnalyticsTestSanity3" name="test_verify_process_status_agent[cb_sanity,dev_sanity_dpdk,sanity]" time="1.410" />

    <testcase classname="scripts.analytics.test_analytics.AnalyticsTestSanity3" name="test_verify_process_status_analytics_node[cb_sanity,dev_sanity_dpdk,sanity]" time="1.861" />

    <testcase classname="scripts.analytics.test_analytics.AnalyticsTestSanity3" name="test_verify_process_status_control_node[cb_sanity,dev_sanity_dpdk,sanity]" time="1.527" />

    <testcase classname="scripts.analytics.test_analytics_basic.AnalyticsBasicTestSanity" name="test_verify_object_logs[ci_sanity,dev_sanity_dpdk,sanity,suite1]" time="50.072" />

    <testcase classname="scripts.db_manage.test_db_manage.DbManageTest" name="test_db_manage[cb_sanity,ci_sanity,dev_sanity_dpdk,sanity]" time="7.709" />

    <testcase classname="scripts.documentation.test_docs.DocumentationTest" name="test_analytics_docs[cb_sanity,ci_sanity,dev_sanity_dpdk,sanity]" time="1.377" />

    <testcase classname="scripts.documentation.test_docs.DocumentationTest" name="test_config_docs[cb_sanity,ci_sanity,dev_sanity_dpdk,sanity]" time="1.345" />

    <testcase classname="scripts.ecmp.test_ecmp.TestECMPConfigHashFeature" name="test_ecmp_hash_src_ip[sanity]" time="1.366">
      <skipped>Skipped as test requires at least 3 nodes, but only 2 found</skipped>

    </testcase>

    <testcase classname="scripts.ecmp.test_ecmp.TestECMPFeature" name="test_ecmp_svc_v2_in_network_nat_with_3_instance[cb_sanity,sanity]" time="1.404">
      <skipped>Skipped as test requires at least 3 nodes, but only 2 found</skipped>

    </testcase>

    <testcase classname="scripts.ecmp.test_ecmp.TestECMPIPv6Fragments" name="test_ecmp_svc_in_network_with_static_route_no_policy[sanity]" time="2.207">
      <skipped>image /contrail-test/images/tinycore-in-network.qcow2 is not found</skipped>

    </testcase>

    <testcase classname="scripts.ecmp.test_ecmp.TestECMPIPv6Fragments" name="test_ecmp_svc_v2_transparent_with_3_instance[cb_sanity,sanity]" time="1.446">
      <skipped>Skipped as test requires at least 3 nodes, but only 2 found</skipped>

    </testcase>

    <testcase classname="scripts.ecmp.test_ecmp.TestECMPSanity" name="test_ecmp_svc_in_network_with_static_route_no_policy[sanity]" time="2.112">
      <skipped>image /contrail-test/images/tinycore-in-network.qcow2 is not found</skipped>

    </testcase>

    <testcase classname="scripts.ecmp.test_ecmp.TestECMPSanity" name="test_ecmp_svc_v2_transparent_with_3_instance[cb_sanity,sanity]" time="1.387">
      <skipped>Skipped as test requires at least 3 nodes, but only 2 found</skipped>

    </testcase>

    <testcase classname="scripts.ecmp.test_ecmp.TestECMPSanityIPv6" name="test_ecmp_svc_in_network_with_3_instance[cb_sanity,sanity]" time="1.371">
      <skipped>Skipped as test requires at least 3 nodes, but only 2 found</skipped>

    </testcase>

    <testcase classname="scripts.ecmp.test_ecmp.TestECMPwithSVMChange" name="test_ecmp_with_svm_deletion[sanity]" time="1.371">
      <skipped>Skipped as test requires at least 3 nodes, but only 2 found</skipped>

    </testcase>

    <testcase classname="scripts.ecmp.test_ecmp.TestMultiInlineSVC" name="test_svc_fate_sharing_basic[sanity]" time="2.149">
      <skipped>image /contrail-test/images/tinycore-in-network.qcow2 is not found</skipped>

    </testcase>

    <testcase classname="scripts.ecmp.test_ecmp.TestMultiInlineSVC" name="test_three_stage_v2_SC[sanity]" time="1.436">
      <skipped>Skipped as test requires at least 3 nodes, but only 2 found</skipped>

    </testcase>

    <testcase classname="scripts.ecmp.test_ecmp.TestMultiInlineSVCIPv6" name="test_svc_fate_sharing_basic[sanity]" time="3.511">
      <skipped>image /contrail-test/images/tinycore-in-network.qcow2 is not found</skipped>

    </testcase>

    <testcase classname="scripts.floatingip.test_floatingip_basic.FloatingipBasicTestSanity" name="test_floating_ip[cb_sanity,ci_contrail_go_kolla_ocata_sanity,ci_sanity,quick_sanity,sanity,suite1,vrouter_gw]" time="181.567" />

    <testcase classname="scripts.floatingip.test_mx.TestSanity_MX" name="test_mx_gateway[mx_test,sanity]" time="2.617">
      <skipped>Skipping Test. Env variable MX_GW_TEST is not set</skipped>

    </testcase>

    <testcase classname="scripts.heat.test_heat.TestHeat" name="test_public_access_thru_svc_w_fip[cb_sanity,sanity]" time="2.697">
      <skipped>Skipped as test requires at least 3 nodes, but only 2 found</skipped>

    </testcase>

    <testcase classname="scripts.heat.test_heat.TestHeat" name="test_transit_vn_sym_1_innet[sanity]" time="2.642">
      <skipped>Skipped as test requires at least 3 nodes, but only 2 found</skipped>

    </testcase>

    <testcase classname="scripts.heat.test_heat.TestHeatIPv6" name="test_public_access_thru_svc_w_fip[cb_sanity,sanity]" time="2.682">
      <skipped>Skipped as v6 not supported for this test</skipped>

    </testcase>

    <testcase classname="scripts.heat.test_heat_basic.TestBasicHeat" name="test_svc_creation_with_heat[dev_sanity_dpdk,sanity,suite1]" time="2.688">
      <skipped>Skipped as test requires at least 3 nodes, but only 2 found</skipped>

    </testcase>

    <testcase classname="scripts.heat.test_heat_basic.TestBasicHeatIPv6" name="test_svc_creation_with_heat[sanity]" time="2.668">
      <skipped>Skipped as test requires at least 3 nodes, but only 2 found</skipped>

    </testcase>

    <testcase classname="scripts.neutron.test_crud.TestCRUD" name="test_network_tags_crud[ci_sanity,sanity]" time="9.292" />

    <testcase classname="scripts.neutron.test_crud.TestCRUD" name="test_router_crud[ci_sanity,dev_sanity_dpdk,sanity]" time="10.417" />

    <testcase classname="scripts.neutron.test_ports.TestPorts" name="test_ports_bindings[ci_sanity,dev_sanity_dpdk,sanity]" time="5.108" />

    <testcase classname="scripts.neutron.test_ports.TestPorts" name="test_ports_specific_subnet_ip[ci_sanity,dev_sanity_dpdk,sanity]" time="45.459" />

    <testcase classname="scripts.neutron.test_routers.TestRouters" name="test_basic_router_behavior[ci_sanity,dev_sanity_dpdk,sanity]" time="68.038" />

    <testcase classname="scripts.neutron.test_routers_basic.TestRoutersBasic" name="test_basic_snat_behavior_without_external_connectivity[ci_sanity,dev_sanity_dpdk,sanity,suite1]" time="53.095" />

    <testcase classname="scripts.policy.test_policy.TestBasicPolicyIpv4v6" name="test_basic_policy_allow_deny[cb_sanity,ci_contrail_go_kolla_ocata_sanity,ci_sanity,quick_sanity,sanity,suite1]" time="183.190" />

    <testcase classname="scripts.policy.test_policy.TestBasicPolicyIpv4v6" name="test_policy[quick_sanity,sanity]" time="248.984" />

    <testcase classname="scripts.policy.test_policy.TestBasicPolicyIpv4v6" name="test_policy_to_deny[quick_sanity,sanity]" time="108.701" />

    <testcase classname="scripts.policy.test_policy.TestBasicPolicyModifyIpv4v6" name="test_policy_modify_vn_policy[sanity]" time="121.301" />

    <testcase classname="scripts.policy.test_policy.TestBasicPolicyNegativeIpv4v6" name="test_remove_policy_with_ref[ci_sanity,sanity]" time="10.568" />

    <testcase classname="scripts.policy.test_policy_acl.TestPolicyAcl" name="test_policy_inheritance_src_vn_dst_pol[cb_sanity,sanity,vrouter_gw]" time="251.508" />

    <testcase classname="scripts.policy.test_policy_acl.TestPolicyAclIpv4v6" name="test_policy_inheritance_src_pol_dst_any[sanity]" time="206.731" />

    <testcase classname="scripts.policy.test_policy_basic.TestBasicPolicy" name="test_basic_policy_allow_deny[cb_sanity,ci_contrail_go_kolla_ocata_sanity,ci_sanity,quick_sanity,sanity,suite1]" time="101.499" />

    <testcase classname="scripts.policy.test_policy_detailed.TestDetailedPolicy0Ipv4v6" name="test_repeated_policy_modify[sanity]" time="192.482" />

    <testcase classname="scripts.policy.test_policy_detailed.TestDetailedPolicy1" name="test_multi_vn_repeated_policy_update_with_ping[sanity]" time="264.966" />

    <testcase classname="scripts.policy.test_policy_detailed.TestDetailedPolicy1Ipv4v6" name="test_multi_vn_repeated_policy_update_with_ping[sanity]" time="233.037" />

    <testcase classname="" name="setUpClass (scripts.qos.test_qos.TestQos)" time="0.000">
      <failure type="testtools.testresult.real._StringException">Traceback (most recent call last):
testtools.testresult.real._StringException: Traceback (most recent call last):
  File &quot;/contrail-test/scripts/qos/test_qos.py&quot;, line 13, in setUpClass
    super(TestQos, cls).setUpClass()
  File &quot;/contrail-test/common/qos/base.py&quot;, line 1187, in setUpClass
    cls.check_vms_booted([cls.vn1_vm1_fixture, cls.vn1_vm2_fixture,
  File &quot;/contrail-test/common/base.py&quot;, line 722, in check_vms_booted
    assert False, &apos;One or more vm-boots failed. Check logs&apos;
AssertionError: One or more vm-boots failed. Check logs

</failure>

    </testcase>

    <testcase classname="scripts.routing_policy.test_routing_policy.TestRP" name="test_rp_interface[ci_sanity,sanity]" time="248.956">
      <failure type="testtools.testresult.real._StringException">Traceback (most recent call last):
testtools.testresult.real._StringException: Traceback (most recent call last):
  File &quot;/contrail-test/tcutils/wrappers.py&quot;, line 176, in wrapper
    raise TestFailed(&quot;\n &quot;.join(errmsg))
tcutils.cores.TestFailed: Test failed: AssertionError
Python 3.9.25: /usr/bin/python3
Mon Oct  5 03:41:30 2026

A problem occurred in a Python script.  Here is the sequence of
function calls leading up to the error, in the order they occurred.

 /contrail-test/tcutils/wrappers.py in wrapper(self=&lt;scripts.routing_policy.test_routing_policy.Test...rp_interface[ci_sanity,sanity] id=0x7efe21556760&gt;, *args=(), **kwargs={})
   78             log.info(&apos;Initial checks done. Running the testcase now&apos;)
   79             log.info(&apos;&apos;)
   80             result = function(self, *args, **kwargs)
   81             if self.inputs.upgrade:
   82                 pid = os.getpid()
result = None
function = &lt;function TestRP.test_rp_interface&gt;
self = &lt;scripts.routing_policy.test_routing_policy.Test...rp_interface[ci_sanity,sanity] id=0x7efe21556760&gt;
args = ()
kwargs = {}

 /contrail-test/scripts/routing_policy/test_routing_policy.py in test_rp_interface(self=&lt;scripts.routing_policy.test_routing_policy.Test...rp_interface[ci_sanity,sanity] id=0x7efe21556760&gt;)
   38         3. Attach policy to VN and confirm if policy takes hold.
   39         &apos;&apos;&apos;
   40         ret_dict = self.config_basic()
   41         vn_fixture = ret_dict[&apos;vn_fixture&apos;]
   42         test_vm = ret_dict[&apos;test_vm&apos;]
ret_dict undefined
self = &lt;scripts.routing_policy.test_routing_policy.Test...rp_interface[ci_sanity,sanity] id=0x7efe21556760&gt;
self.config_basic = &lt;bound method RPBase.config_basic of &lt;scripts.ro...p_interface[ci_sanity,sanity] id=0x7efe21556760&gt;&gt;

 /contrail-test/scripts/routing_policy/base.py in config_basic(self=&lt;scripts.routing_policy.test_routing_policy.Test...rp_interface[ci_sanity,sanity] id=0x7efe21556760&gt;)
   44         test2_vm = self.create_vm(vn2_fixture, &apos;test2_vm&apos;, image_name=&apos;cirros&apos;)
   45         assert test_vm.wait_till_vm_is_up()
   46         assert test2_vm.wait_till_vm_is_up()
   47 
   48         ret_dict = {
test2_vm = &lt;VMFixture: test2_vm&gt;
test2_vm.wait_till_vm_is_up = &lt;bound method VMFixture.wait_till_vm_is_up of &lt;VMFixture: test2_vm&gt;&gt;
AssertionError: 
    __cause__ = None
    __class__ = &lt;class &apos;AssertionError&apos;&gt;
    __context__ = None
    __delattr__ = &lt;method-wrapper &apos;__delattr__&apos; of AssertionError object&gt;
    __dict__ = {}
    __dir__ = &lt;built-in method __dir__ of AssertionError object&gt;
    __doc__ = &apos;Assertion failed.&apos;
    __eq__ = &lt;method-wrapper &apos;__eq__&apos; of AssertionError object&gt;
    __format__ = &lt;built-in method __format__ of AssertionError object&gt;
    __ge__ = &lt;method-wrapper &apos;__ge__&apos; of AssertionError object&gt;
    __getattribute__ = &lt;method-wrapper &apos;__getattribute__&apos; of AssertionError object&gt;
    __gt__ = &lt;method-wrapper &apos;__gt__&apos; of AssertionError object&gt;
    __hash__ = &lt;method-wrapper &apos;__hash__&apos; of AssertionError object&gt;
    __init__ = &lt;method-wrapper &apos;__init__&apos; of AssertionError object&gt;
    __init_subclass__ = &lt;built-in method __init_subclass__ of type object&gt;
    __le__ = &lt;method-wrapper &apos;__le__&apos; of AssertionError object&gt;
    __lt__ = &lt;method-wrapper &apos;__lt__&apos; of AssertionError object&gt;
    __ne__ = &lt;method-wrapper &apos;__ne__&apos; of AssertionError object&gt;
    __new__ = &lt;built-in method __new__ of type object&gt;
    __reduce__ = &lt;built-in method __reduce__ of AssertionError object&gt;
    __reduce_ex__ = &lt;built-in method __reduce_ex__ of AssertionError object&gt;
    __repr__ = &lt;method-wrapper &apos;__repr__&apos; of AssertionError object&gt;
    __setattr__ = &lt;method-wrapper &apos;__setattr__&apos; of AssertionError object&gt;
    __setstate__ = &lt;built-in method __setstate__ of AssertionError object&gt;
    __sizeof__ = &lt;built-in method __sizeof__ of AssertionError object&gt;
    __str__ = &lt;method-wrapper &apos;__str__&apos; of AssertionError object&gt;
    __subclasshook__ = &lt;built-in method __subclasshook__ of type object&gt;
    __suppress_context__ = False
    __traceback__ = &lt;traceback object&gt;
    args = ()
    with_traceback = &lt;built-in method with_traceback of AssertionError object&gt;

The above is a description of an error in a Python program.  Here is
the original traceback:

Traceback (most recent call last):
  File &quot;/contrail-test/tcutils/wrappers.py&quot;, line 80, in wrapper
    result = function(self, *args, **kwargs)
  File &quot;/contrail-test/scripts/routing_policy/test_routing_policy.py&quot;, line 40, in test_rp_interface
    ret_dict = self.config_basic()
  File &quot;/contrail-test/scripts/routing_policy/base.py&quot;, line 46, in config_basic
    assert test2_vm.wait_till_vm_is_up()
AssertionError

</failure>

    </testcase>

    <testcase classname="scripts.routing_policy.test_routing_policy.TestRP" name="test_rp_interface_ext_community[sanity]" time="194.580">
      <failure type="testtools.testresult.real._StringException">Traceback (most recent call last):
testtools.testresult.real._StringException: Traceback (most recent call last):
  File &quot;/contrail-test/tcutils/wrappers.py&quot;, line 176, in wrapper
    raise TestFailed(&quot;\n &quot;.join(errmsg))
tcutils.cores.TestFailed: Test failed: AssertionError
Python 3.9.25: /usr/bin/python3
Mon Oct  5 03:45:34 2026

A problem occurred in a Python script.  Here is the sequence of
function calls leading up to the error, in the order they occurred.

 /contrail-test/tcutils/wrappers.py in wrapper(self=&lt;scripts.routing_policy.test_routing_policy.Test...nterface_ext_community[sanity] id=0x7efe215566a0&gt;, *args=(), **kwargs={})
   78             log.info(&apos;Initial checks done. Running the testcase now&apos;)
   79             log.info(&apos;&apos;)
   80             result = function(self, *args, **kwargs)
   81             if self.inputs.upgrade:
   82                 pid = os.getpid()
result = None
function = &lt;function TestRP.test_rp_interface_ext_community&gt;
self = &lt;scripts.routing_policy.test_routing_policy.Test...nterface_ext_community[sanity] id=0x7efe215566a0&gt;
args = ()
kwargs = {}

 /contrail-test/scripts/routing_policy/test_routing_policy.py in test_rp_interface_ext_community(self=&lt;scripts.routing_policy.test_routing_policy.Test...nterface_ext_community[sanity] id=0x7efe215566a0&gt;)
  249         3. Attach policy to VN and confirm if policy takes hold.
  250         &apos;&apos;&apos;
  251         ret_dict = self.config_basic()
  252         vn_fixture = ret_dict[&apos;vn_fixture&apos;]
  253         test_vm = ret_dict[&apos;test_vm&apos;]
ret_dict undefined
self = &lt;scripts.routing_policy.test_routing_policy.Test...nterface_ext_community[sanity] id=0x7efe215566a0&gt;
self.config_basic = &lt;bound method RPBase.config_basic of &lt;scripts.ro...terface_ext_community[sanity] id=0x7efe215566a0&gt;&gt;

 /contrail-test/scripts/routing_policy/base.py in config_basic(self=&lt;scripts.routing_policy.test_routing_policy.Test...nterface_ext_community[sanity] id=0x7efe215566a0&gt;)
   44         test2_vm = self.create_vm(vn2_fixture, &apos;test2_vm&apos;, image_name=&apos;cirros&apos;)
   45         assert test_vm.wait_till_vm_is_up()
   46         assert test2_vm.wait_till_vm_is_up()
   47 
   48         ret_dict = {
test2_vm = &lt;VMFixture: test2_vm&gt;
test2_vm.wait_till_vm_is_up = &lt;bound method VMFixture.wait_till_vm_is_up of &lt;VMFixture: test2_vm&gt;&gt;
AssertionError: 
    __cause__ = None
    __class__ = &lt;class &apos;AssertionError&apos;&gt;
    __context__ = None
    __delattr__ = &lt;method-wrapper &apos;__delattr__&apos; of AssertionError object&gt;
    __dict__ = {}
    __dir__ = &lt;built-in method __dir__ of AssertionError object&gt;
    __doc__ = &apos;Assertion failed.&apos;
    __eq__ = &lt;method-wrapper &apos;__eq__&apos; of AssertionError object&gt;
    __format__ = &lt;built-in method __format__ of AssertionError object&gt;
    __ge__ = &lt;method-wrapper &apos;__ge__&apos; of AssertionError object&gt;
    __getattribute__ = &lt;method-wrapper &apos;__getattribute__&apos; of AssertionError object&gt;
    __gt__ = &lt;method-wrapper &apos;__gt__&apos; of AssertionError object&gt;
    __hash__ = &lt;method-wrapper &apos;__hash__&apos; of AssertionError object&gt;
    __init__ = &lt;method-wrapper &apos;__init__&apos; of AssertionError object&gt;
    __init_subclass__ = &lt;built-in method __init_subclass__ of type object&gt;
    __le__ = &lt;method-wrapper &apos;__le__&apos; of AssertionError object&gt;
    __lt__ = &lt;method-wrapper &apos;__lt__&apos; of AssertionError object&gt;
    __ne__ = &lt;method-wrapper &apos;__ne__&apos; of AssertionError object&gt;
    __new__ = &lt;built-in method __new__ of type object&gt;
    __reduce__ = &lt;built-in method __reduce__ of AssertionError object&gt;
    __reduce_ex__ = &lt;built-in method __reduce_ex__ of AssertionError object&gt;
    __repr__ = &lt;method-wrapper &apos;__repr__&apos; of AssertionError object&gt;
    __setattr__ = &lt;method-wrapper &apos;__setattr__&apos; of AssertionError object&gt;
    __setstate__ = &lt;built-in method __setstate__ of AssertionError object&gt;
    __sizeof__ = &lt;built-in method __sizeof__ of AssertionError object&gt;
    __str__ = &lt;method-wrapper &apos;__str__&apos; of AssertionError object&gt;
    __subclasshook__ = &lt;built-in method __subclasshook__ of type object&gt;
    __suppress_context__ = False
    __traceback__ = &lt;traceback object&gt;
    args = ()
    with_traceback = &lt;built-in method with_traceback of AssertionError object&gt;

The above is a description of an error in a Python program.  Here is
the original traceback:

Traceback (most recent call last):
  File &quot;/contrail-test/tcutils/wrappers.py&quot;, line 80, in wrapper
    result = function(self, *args, **kwargs)
  File &quot;/contrail-test/scripts/routing_policy/test_routing_policy.py&quot;, line 251, in test_rp_interface_ext_community
    ret_dict = self.config_basic()
  File &quot;/contrail-test/scripts/routing_policy/base.py&quot;, line 46, in config_basic
    assert test2_vm.wait_till_vm_is_up()
AssertionError

</failure>

    </testcase>

    <testcase classname="scripts.routing_policy.test_routing_policy.TestRP" name="test_rp_interface_static[sanity]" time="57.362">
      <failure type="testtools.testresult.real._StringException">Traceback (most recent call last):
testtools.testresult.real._StringException: Traceback (most recent call last):
  File &quot;/contrail-test/tcutils/wrappers.py&quot;, line 176, in wrapper
    raise TestFailed(&quot;\n &quot;.join(errmsg))
tcutils.cores.TestFailed: Test failed: AssertionError
Python 3.9.25: /usr/bin/python3
Mon Oct  5 03:46:33 2026

A problem occurred in a Python script.  Here is the sequence of
function calls leading up to the error, in the order they occurred.

 /contrail-test/tcutils/wrappers.py in wrapper(self=&lt;scripts.routing_policy.test_routing_policy.Test...st_rp_interface_static[sanity] id=0x7efe21556520&gt;, *args=(), **kwargs={})
   78             log.info(&apos;Initial checks done. Running the testcase now&apos;)
   79             log.info(&apos;&apos;)
   80             result = function(self, *args, **kwargs)
   81             if self.inputs.upgrade:
   82                 pid = os.getpid()
result = None
function = &lt;function TestRP.test_rp_interface_static&gt;
self = &lt;scripts.routing_policy.test_routing_policy.Test...st_rp_interface_static[sanity] id=0x7efe21556520&gt;
args = ()
kwargs = {}

 /contrail-test/scripts/routing_policy/test_routing_policy.py in test_rp_interface_static(self=&lt;scripts.routing_policy.test_routing_policy.Test...st_rp_interface_static[sanity] id=0x7efe21556520&gt;)
   56         &apos;&apos;&apos;
   57 
   58         ret_dict,random_cidr = self.create_interface_static_routes()
   59         config_dicts = {&apos;vn_fixture&apos;:ret_dict[&apos;vn_fixture&apos;], &apos;from_term&apos;:&apos;protocol&apos;, &apos;sub_from&apos;:&apos;interface-static&apos;, &apos;to_term&apos;:&apos;community&apos;, &apos;sub_to&apos;:&apos;64512:55555&apos;}
   60         rp = self.configure_term_routing_policy(config_dicts)
ret_dict undefined
random_cidr undefined
self = &lt;scripts.routing_policy.test_routing_policy.Test...st_rp_interface_static[sanity] id=0x7efe21556520&gt;
self.create_interface_static_routes = &lt;bound method TestRP.create_interface_static_rou...t_rp_interface_static[sanity] id=0x7efe21556520&gt;&gt;

 /contrail-test/scripts/routing_policy/test_routing_policy.py in create_interface_static_routes(self=&lt;scripts.routing_policy.test_routing_policy.Test...st_rp_interface_static[sanity] id=0x7efe21556520&gt;)
  576 
  577     def create_interface_static_routes(self):
  578         ret_dict = self.config_basic()
  579         self.static_table_handle = ContrailVncApi(self.vnc_lib, self.logger)
  580         random_cidr = get_random_cidr()
ret_dict undefined
self = &lt;scripts.routing_policy.test_routing_policy.Test...st_rp_interface_static[sanity] id=0x7efe21556520&gt;
self.config_basic = &lt;bound method RPBase.config_basic of &lt;scripts.ro...t_rp_interface_static[sanity] id=0x7efe21556520&gt;&gt;

 /contrail-test/scripts/routing_policy/base.py in config_basic(self=&lt;scripts.routing_policy.test_routing_policy.Test...st_rp_interface_static[sanity] id=0x7efe21556520&gt;)
   43                                  image_name=&apos;cirros&apos;)
   44         test2_vm = self.create_vm(vn2_fixture, &apos;test2_vm&apos;, image_name=&apos;cirros&apos;)
   45         assert test_vm.wait_till_vm_is_up()
   46         assert test2_vm.wait_till_vm_is_up()
   47 
test_vm = &lt;VMFixture: test_vm&gt;
test_vm.wait_till_vm_is_up = &lt;bound method VMFixture.wait_till_vm_is_up of &lt;VMFixture: test_vm&gt;&gt;
AssertionError: 
    __cause__ = None
    __class__ = &lt;class &apos;AssertionError&apos;&gt;
    __context__ = None
    __delattr__ = &lt;method-wrapper &apos;__delattr__&apos; of AssertionError object&gt;
    __dict__ = {}
    __dir__ = &lt;built-in method __dir__ of AssertionError object&gt;
    __doc__ = &apos;Assertion failed.&apos;
    __eq__ = &lt;method-wrapper &apos;__eq__&apos; of AssertionError object&gt;
    __format__ = &lt;built-in method __format__ of AssertionError object&gt;
    __ge__ = &lt;method-wrapper &apos;__ge__&apos; of AssertionError object&gt;
    __getattribute__ = &lt;method-wrapper &apos;__getattribute__&apos; of AssertionError object&gt;
    __gt__ = &lt;method-wrapper &apos;__gt__&apos; of AssertionError object&gt;
    __hash__ = &lt;method-wrapper &apos;__hash__&apos; of AssertionError object&gt;
    __init__ = &lt;method-wrapper &apos;__init__&apos; of AssertionError object&gt;
    __init_subclass__ = &lt;built-in method __init_subclass__ of type object&gt;
    __le__ = &lt;method-wrapper &apos;__le__&apos; of AssertionError object&gt;
    __lt__ = &lt;method-wrapper &apos;__lt__&apos; of AssertionError object&gt;
    __ne__ = &lt;method-wrapper &apos;__ne__&apos; of AssertionError object&gt;
    __new__ = &lt;built-in method __new__ of type object&gt;
    __reduce__ = &lt;built-in method __reduce__ of AssertionError object&gt;
    __reduce_ex__ = &lt;built-in method __reduce_ex__ of AssertionError object&gt;
    __repr__ = &lt;method-wrapper &apos;__repr__&apos; of AssertionError object&gt;
    __setattr__ = &lt;method-wrapper &apos;__setattr__&apos; of AssertionError object&gt;
    __setstate__ = &lt;built-in method __setstate__ of AssertionError object&gt;
    __sizeof__ = &lt;built-in method __sizeof__ of AssertionError object&gt;
    __str__ = &lt;method-wrapper &apos;__str__&apos; of AssertionError object&gt;
    __subclasshook__ = &lt;built-in method __subclasshook__ of type object&gt;
    __suppress_context__ = False
    __traceback__ = &lt;traceback object&gt;
    args = ()
    with_traceback = &lt;built-in method with_traceback of AssertionError object&gt;

The above is a description of an error in a Python program.  Here is
the original traceback:

Traceback (most recent call last):
  File &quot;/contrail-test/tcutils/wrappers.py&quot;, line 80, in wrapper
    result = function(self, *args, **kwargs)
  File &quot;/contrail-test/scripts/routing_policy/test_routing_policy.py&quot;, line 58, in test_rp_interface_static
    ret_dict,random_cidr = self.create_interface_static_routes()
  File &quot;/contrail-test/scripts/routing_policy/test_routing_policy.py&quot;, line 578, in create_interface_static_routes
    ret_dict = self.config_basic()
  File &quot;/contrail-test/scripts/routing_policy/base.py&quot;, line 45, in config_basic
    assert test_vm.wait_till_vm_is_up()
AssertionError

</failure>

    </testcase>

    <testcase classname="scripts.routing_policy.test_routing_policy.TestRP" name="test_rp_secondary_routes[sanity]" time="0.003">
      <skipped>Needs MX_GW_TEST to be set</skipped>

    </testcase>

    <testcase classname="scripts.rt_filter.test_rt_filter.TestBasicRTFilter" name="test_rt_CEM_22032[cb_sanity,sanity]" time="94.813" />

    <testcase classname="scripts.rt_filter.test_rt_filter.TestBasicRTFilter" name="test_user_def_rt_entry[cb_sanity,sanity]" time="265.139">
      <failure type="testtools.testresult.real._StringException">Traceback (most recent call last):
testtools.testresult.real._StringException: Traceback (most recent call last):
  File &quot;/contrail-test/tcutils/wrappers.py&quot;, line 176, in wrapper
    raise TestFailed(&quot;\n &quot;.join(errmsg))
tcutils.cores.TestFailed: Test failed: AssertionError
Python 3.9.25: /usr/bin/python3
Mon Oct  5 03:52:00 2026

A problem occurred in a Python script.  Here is the sequence of
function calls leading up to the error, in the order they occurred.

 /contrail-test/tcutils/wrappers.py in wrapper(self=&lt;scripts.rt_filter.test_rt_filter.TestBasicRTFil...def_rt_entry[cb_sanity,sanity] id=0x7efe214ef1f0&gt;, *args=(), **kwargs={})
   78             log.info(&apos;Initial checks done. Running the testcase now&apos;)
   79             log.info(&apos;&apos;)
   80             result = function(self, *args, **kwargs)
   81             if self.inputs.upgrade:
   82                 pid = os.getpid()
result = None
function = &lt;function TestBasicRTFilter.test_user_def_rt_entry&gt;
self = &lt;scripts.rt_filter.test_rt_filter.TestBasicRTFil...def_rt_entry[cb_sanity,sanity] id=0x7efe214ef1f0&gt;
args = ()
kwargs = {}

 /contrail-test/scripts/rt_filter/test_rt_filter.py in test_user_def_rt_entry(self=&lt;scripts.rt_filter.test_rt_filter.TestBasicRTFil...def_rt_entry[cb_sanity,sanity] id=0x7efe214ef1f0&gt;)
   84         vm1_fixture = self.create_vm(vn1_fixture, vm_name=vn1_vm1_name,
   85                                      flavor=&apos;contrail_flavor_small&apos;, image_name=&apos;ubuntu-traffic&apos;)
   86         assert vm1_fixture.wait_till_vm_is_up()
   87         ip = vm1_fixture.vm_ip + &apos;/32&apos;
   88         active_ctrl_node = self.get_active_control_node(vm1_fixture)
vm1_fixture = &lt;VMFixture: ctest-vm1-96296807&gt;
vm1_fixture.wait_till_vm_is_up = &lt;bound method VMFixture.wait_till_vm_is_up of &lt;VMFixture: ctest-vm1-96296807&gt;&gt;
AssertionError: 
    __cause__ = None
    __class__ = &lt;class &apos;AssertionError&apos;&gt;
    __context__ = None
    __delattr__ = &lt;method-wrapper &apos;__delattr__&apos; of AssertionError object&gt;
    __dict__ = {}
    __dir__ = &lt;built-in method __dir__ of AssertionError object&gt;
    __doc__ = &apos;Assertion failed.&apos;
    __eq__ = &lt;method-wrapper &apos;__eq__&apos; of AssertionError object&gt;
    __format__ = &lt;built-in method __format__ of AssertionError object&gt;
    __ge__ = &lt;method-wrapper &apos;__ge__&apos; of AssertionError object&gt;
    __getattribute__ = &lt;method-wrapper &apos;__getattribute__&apos; of AssertionError object&gt;
    __gt__ = &lt;method-wrapper &apos;__gt__&apos; of AssertionError object&gt;
    __hash__ = &lt;method-wrapper &apos;__hash__&apos; of AssertionError object&gt;
    __init__ = &lt;method-wrapper &apos;__init__&apos; of AssertionError object&gt;
    __init_subclass__ = &lt;built-in method __init_subclass__ of type object&gt;
    __le__ = &lt;method-wrapper &apos;__le__&apos; of AssertionError object&gt;
    __lt__ = &lt;method-wrapper &apos;__lt__&apos; of AssertionError object&gt;
    __ne__ = &lt;method-wrapper &apos;__ne__&apos; of AssertionError object&gt;
    __new__ = &lt;built-in method __new__ of type object&gt;
    __reduce__ = &lt;built-in method __reduce__ of AssertionError object&gt;
    __reduce_ex__ = &lt;built-in method __reduce_ex__ of AssertionError object&gt;
    __repr__ = &lt;method-wrapper &apos;__repr__&apos; of AssertionError object&gt;
    __setattr__ = &lt;method-wrapper &apos;__setattr__&apos; of AssertionError object&gt;
    __setstate__ = &lt;built-in method __setstate__ of AssertionError object&gt;
    __sizeof__ = &lt;built-in method __sizeof__ of AssertionError object&gt;
    __str__ = &lt;method-wrapper &apos;__str__&apos; of AssertionError object&gt;
    __subclasshook__ = &lt;built-in method __subclasshook__ of type object&gt;
    __suppress_context__ = False
    __traceback__ = &lt;traceback object&gt;
    args = ()
    with_traceback = &lt;built-in method with_traceback of AssertionError object&gt;

The above is a description of an error in a Python program.  Here is
the original traceback:

Traceback (most recent call last):
  File &quot;/contrail-test/tcutils/wrappers.py&quot;, line 80, in wrapper
    result = function(self, *args, **kwargs)
  File &quot;/contrail-test/scripts/rt_filter/test_rt_filter.py&quot;, line 86, in test_user_def_rt_entry
    assert vm1_fixture.wait_till_vm_is_up()
AssertionError

</failure>

    </testcase>

    <testcase classname="scripts.securitygroup.test_regression.SecurityGroupBasicRegressionTests1Ipv6" name="test_sec_group_basic[sanity,suite1]" time="263.107">
      <failure type="testtools.testresult.real._StringException">Traceback (most recent call last):
testtools.testresult.real._StringException: Traceback (most recent call last):
  File &quot;/contrail-test/scripts/securitygroup/test_regression.py&quot;, line 2149, in test_sec_group_basic
    super(SecurityGroupBasicRegressionTests1Ipv6, self).test_sec_group_basic()
  File &quot;/contrail-test/tcutils/wrappers.py&quot;, line 176, in wrapper
    raise TestFailed(&quot;\n &quot;.join(errmsg))
tcutils.cores.TestFailed: Test failed: AssertionError
Python 3.9.25: /usr/bin/python3
Mon Oct  5 03:59:01 2026

A problem occurred in a Python script.  Here is the sequence of
function calls leading up to the error, in the order they occurred.

 /contrail-test/tcutils/wrappers.py in wrapper(self=&lt;scripts.securitygroup.test_regression.SecurityG...sec_group_basic[sanity,suite1] id=0x7efe21501340&gt;, *args=(), **kwargs={})
   78             log.info(&apos;Initial checks done. Running the testcase now&apos;)
   79             log.info(&apos;&apos;)
   80             result = function(self, *args, **kwargs)
   81             if self.inputs.upgrade:
   82                 pid = os.getpid()
result = None
function = &lt;function SecurityGroupBasicRegressionTests1.test_sec_group_basic&gt;
self = &lt;scripts.securitygroup.test_regression.SecurityG...sec_group_basic[sanity,suite1] id=0x7efe21501340&gt;
args = ()
kwargs = {}

 /contrail-test/scripts/securitygroup/test_regression_basic.py in test_sec_group_basic(self=&lt;scripts.securitygroup.test_regression.SecurityG...sec_group_basic[sanity,suite1] id=0x7efe21501340&gt;)
   89         assert vm1_fixture.verify_on_setup()
   90         assert vm1_fixture.wait_till_vm_is_up()
   91         assert vm2_fixture.verify_on_setup()
   92         assert vm2_fixture.wait_till_vm_is_up()
   93 
vm2_fixture = &lt;VMFixture: ctest-SecurityGroupBasicRegressionTests1Ipv6-04442983-39421889&gt;
vm2_fixture.verify_on_setup = &lt;bound method VMFixture.verify_on_setup of &lt;VMFi...roupBasicRegressionTests1Ipv6-04442983-39421889&gt;&gt;
AssertionError: 
    __cause__ = None
    __class__ = &lt;class &apos;AssertionError&apos;&gt;
    __context__ = None
    __delattr__ = &lt;method-wrapper &apos;__delattr__&apos; of AssertionError object&gt;
    __dict__ = {}
    __dir__ = &lt;built-in method __dir__ of AssertionError object&gt;
    __doc__ = &apos;Assertion failed.&apos;
    __eq__ = &lt;method-wrapper &apos;__eq__&apos; of AssertionError object&gt;
    __format__ = &lt;built-in method __format__ of AssertionError object&gt;
    __ge__ = &lt;method-wrapper &apos;__ge__&apos; of AssertionError object&gt;
    __getattribute__ = &lt;method-wrapper &apos;__getattribute__&apos; of AssertionError object&gt;
    __gt__ = &lt;method-wrapper &apos;__gt__&apos; of AssertionError object&gt;
    __hash__ = &lt;method-wrapper &apos;__hash__&apos; of AssertionError object&gt;
    __init__ = &lt;method-wrapper &apos;__init__&apos; of AssertionError object&gt;
    __init_subclass__ = &lt;built-in method __init_subclass__ of type object&gt;
    __le__ = &lt;method-wrapper &apos;__le__&apos; of AssertionError object&gt;
    __lt__ = &lt;method-wrapper &apos;__lt__&apos; of AssertionError object&gt;
    __ne__ = &lt;method-wrapper &apos;__ne__&apos; of AssertionError object&gt;
    __new__ = &lt;built-in method __new__ of type object&gt;
    __reduce__ = &lt;built-in method __reduce__ of AssertionError object&gt;
    __reduce_ex__ = &lt;built-in method __reduce_ex__ of AssertionError object&gt;
    __repr__ = &lt;method-wrapper &apos;__repr__&apos; of AssertionError object&gt;
    __setattr__ = &lt;method-wrapper &apos;__setattr__&apos; of AssertionError object&gt;
    __setstate__ = &lt;built-in method __setstate__ of AssertionError object&gt;
    __sizeof__ = &lt;built-in method __sizeof__ of AssertionError object&gt;
    __str__ = &lt;method-wrapper &apos;__str__&apos; of AssertionError object&gt;
    __subclasshook__ = &lt;built-in method __subclasshook__ of type object&gt;
    __suppress_context__ = False
    __traceback__ = &lt;traceback object&gt;
    args = ()
    with_traceback = &lt;built-in method with_traceback of AssertionError object&gt;

The above is a description of an error in a Python program.  Here is
the original traceback:

Traceback (most recent call last):
  File &quot;/contrail-test/tcutils/wrappers.py&quot;, line 80, in wrapper
    result = function(self, *args, **kwargs)
  File &quot;/contrail-test/scripts/securitygroup/test_regression_basic.py&quot;, line 91, in test_sec_group_basic
    assert vm2_fixture.verify_on_setup()
AssertionError

</failure>

    </testcase>

    <testcase classname="scripts.securitygroup.test_regression.SecurityGroupBasicRegressionTests1_contrail" name="test_sec_group_basic[sanity,suite1]" time="265.202">
      <failure type="testtools.testresult.real._StringException">Traceback (most recent call last):
testtools.testresult.real._StringException: Traceback (most recent call last):
  File &quot;/contrail-test/scripts/securitygroup/test_regression.py&quot;, line 2077, in test_sec_group_basic
    super(SecurityGroupBasicRegressionTests1_contrail, self).test_sec_group_basic()
  File &quot;/contrail-test/tcutils/wrappers.py&quot;, line 176, in wrapper
    raise TestFailed(&quot;\n &quot;.join(errmsg))
tcutils.cores.TestFailed: Test failed: AssertionError
Python 3.9.25: /usr/bin/python3
Mon Oct  5 04:03:12 2026

A problem occurred in a Python script.  Here is the sequence of
function calls leading up to the error, in the order they occurred.

 /contrail-test/tcutils/wrappers.py in wrapper(self=&lt;scripts.securitygroup.test_regression.SecurityG...sec_group_basic[sanity,suite1] id=0x7efe21501a90&gt;, *args=(), **kwargs={})
   78             log.info(&apos;Initial checks done. Running the testcase now&apos;)
   79             log.info(&apos;&apos;)
   80             result = function(self, *args, **kwargs)
   81             if self.inputs.upgrade:
   82                 pid = os.getpid()
result = None
function = &lt;function SecurityGroupBasicRegressionTests1.test_sec_group_basic&gt;
self = &lt;scripts.securitygroup.test_regression.SecurityG...sec_group_basic[sanity,suite1] id=0x7efe21501a90&gt;
args = ()
kwargs = {}

 /contrail-test/scripts/securitygroup/test_regression_basic.py in test_sec_group_basic(self=&lt;scripts.securitygroup.test_regression.SecurityG...sec_group_basic[sanity,suite1] id=0x7efe21501a90&gt;)
   89         assert vm1_fixture.verify_on_setup()
   90         assert vm1_fixture.wait_till_vm_is_up()
   91         assert vm2_fixture.verify_on_setup()
   92         assert vm2_fixture.wait_till_vm_is_up()
   93 
vm2_fixture = &lt;VMFixture: ctest-SecurityGroupBasicRegressionTests1_contrail-34544971-39589726&gt;
vm2_fixture.verify_on_setup = &lt;bound method VMFixture.verify_on_setup of &lt;VMFi...asicRegressionTests1_contrail-34544971-39589726&gt;&gt;
AssertionError: 
    __cause__ = None
    __class__ = &lt;class &apos;AssertionError&apos;&gt;
    __context__ = None
    __delattr__ = &lt;method-wrapper &apos;__delattr__&apos; of AssertionError object&gt;
    __dict__ = {}
    __dir__ = &lt;built-in method __dir__ of AssertionError object&gt;
    __doc__ = &apos;Assertion failed.&apos;
    __eq__ = &lt;method-wrapper &apos;__eq__&apos; of AssertionError object&gt;
    __format__ = &lt;built-in method __format__ of AssertionError object&gt;
    __ge__ = &lt;method-wrapper &apos;__ge__&apos; of AssertionError object&gt;
    __getattribute__ = &lt;method-wrapper &apos;__getattribute__&apos; of AssertionError object&gt;
    __gt__ = &lt;method-wrapper &apos;__gt__&apos; of AssertionError object&gt;
    __hash__ = &lt;method-wrapper &apos;__hash__&apos; of AssertionError object&gt;
    __init__ = &lt;method-wrapper &apos;__init__&apos; of AssertionError object&gt;
    __init_subclass__ = &lt;built-in method __init_subclass__ of type object&gt;
    __le__ = &lt;method-wrapper &apos;__le__&apos; of AssertionError object&gt;
    __lt__ = &lt;method-wrapper &apos;__lt__&apos; of AssertionError object&gt;
    __ne__ = &lt;method-wrapper &apos;__ne__&apos; of AssertionError object&gt;
    __new__ = &lt;built-in method __new__ of type object&gt;
    __reduce__ = &lt;built-in method __reduce__ of AssertionError object&gt;
    __reduce_ex__ = &lt;built-in method __reduce_ex__ of AssertionError object&gt;
    __repr__ = &lt;method-wrapper &apos;__repr__&apos; of AssertionError object&gt;
    __setattr__ = &lt;method-wrapper &apos;__setattr__&apos; of AssertionError object&gt;
    __setstate__ = &lt;built-in method __setstate__ of AssertionError object&gt;
    __sizeof__ = &lt;built-in method __sizeof__ of AssertionError object&gt;
    __str__ = &lt;method-wrapper &apos;__str__&apos; of AssertionError object&gt;
    __subclasshook__ = &lt;built-in method __subclasshook__ of type object&gt;
    __suppress_context__ = False
    __traceback__ = &lt;traceback object&gt;
    args = ()
    with_traceback = &lt;built-in method with_traceback of AssertionError object&gt;

The above is a description of an error in a Python program.  Here is
the original traceback:

Traceback (most recent call last):
  File &quot;/contrail-test/tcutils/wrappers.py&quot;, line 80, in wrapper
    result = function(self, *args, **kwargs)
  File &quot;/contrail-test/scripts/securitygroup/test_regression_basic.py&quot;, line 91, in test_sec_group_basic
    assert vm2_fixture.verify_on_setup()
AssertionError

</failure>

    </testcase>

    <testcase classname="scripts.securitygroup.test_regression_basic.SecurityGroupBasicRegressionTests1" name="test_sec_group_basic[cb_sanity,ci_contrail_go_kolla_ocata_sanity,sanity,suite1]" time="265.784">
      <failure type="testtools.testresult.real._StringException">Traceback (most recent call last):
testtools.testresult.real._StringException: Traceback (most recent call last):
  File &quot;/contrail-test/tcutils/wrappers.py&quot;, line 176, in wrapper
    raise TestFailed(&quot;\n &quot;.join(errmsg))
tcutils.cores.TestFailed: Test failed: AssertionError
Python 3.9.25: /usr/bin/python3
Mon Oct  5 04:07:41 2026

A problem occurred in a Python script.  Here is the sequence of
function calls leading up to the error, in the order they occurred.

 /contrail-test/tcutils/wrappers.py in wrapper(self=&lt;scripts.securitygroup.test_regression_basic.Sec...la_ocata_sanity,sanity,suite1] id=0x7efe214ba400&gt;, *args=(), **kwargs={})
   78             log.info(&apos;Initial checks done. Running the testcase now&apos;)
   79             log.info(&apos;&apos;)
   80             result = function(self, *args, **kwargs)
   81             if self.inputs.upgrade:
   82                 pid = os.getpid()
result = None
function = &lt;function SecurityGroupBasicRegressionTests1.test_sec_group_basic&gt;
self = &lt;scripts.securitygroup.test_regression_basic.Sec...la_ocata_sanity,sanity,suite1] id=0x7efe214ba400&gt;
args = ()
kwargs = {}

 /contrail-test/scripts/securitygroup/test_regression_basic.py in test_sec_group_basic(self=&lt;scripts.securitygroup.test_regression_basic.Sec...la_ocata_sanity,sanity,suite1] id=0x7efe214ba400&gt;)
   89         assert vm1_fixture.verify_on_setup()
   90         assert vm1_fixture.wait_till_vm_is_up()
   91         assert vm2_fixture.verify_on_setup()
   92         assert vm2_fixture.wait_till_vm_is_up()
   93 
vm2_fixture = &lt;VMFixture: ctest-SecurityGroupBasicRegressionTests1-37697791-26105840&gt;
vm2_fixture.verify_on_setup = &lt;bound method VMFixture.verify_on_setup of &lt;VMFi...ityGroupBasicRegressionTests1-37697791-26105840&gt;&gt;
AssertionError: 
    __cause__ = None
    __class__ = &lt;class &apos;AssertionError&apos;&gt;
    __context__ = None
    __delattr__ = &lt;method-wrapper &apos;__delattr__&apos; of AssertionError object&gt;
    __dict__ = {}
    __dir__ = &lt;built-in method __dir__ of AssertionError object&gt;
    __doc__ = &apos;Assertion failed.&apos;
    __eq__ = &lt;method-wrapper &apos;__eq__&apos; of AssertionError object&gt;
    __format__ = &lt;built-in method __format__ of AssertionError object&gt;
    __ge__ = &lt;method-wrapper &apos;__ge__&apos; of AssertionError object&gt;
    __getattribute__ = &lt;method-wrapper &apos;__getattribute__&apos; of AssertionError object&gt;
    __gt__ = &lt;method-wrapper &apos;__gt__&apos; of AssertionError object&gt;
    __hash__ = &lt;method-wrapper &apos;__hash__&apos; of AssertionError object&gt;
    __init__ = &lt;method-wrapper &apos;__init__&apos; of AssertionError object&gt;
    __init_subclass__ = &lt;built-in method __init_subclass__ of type object&gt;
    __le__ = &lt;method-wrapper &apos;__le__&apos; of AssertionError object&gt;
    __lt__ = &lt;method-wrapper &apos;__lt__&apos; of AssertionError object&gt;
    __ne__ = &lt;method-wrapper &apos;__ne__&apos; of AssertionError object&gt;
    __new__ = &lt;built-in method __new__ of type object&gt;
    __reduce__ = &lt;built-in method __reduce__ of AssertionError object&gt;
    __reduce_ex__ = &lt;built-in method __reduce_ex__ of AssertionError object&gt;
    __repr__ = &lt;method-wrapper &apos;__repr__&apos; of AssertionError object&gt;
    __setattr__ = &lt;method-wrapper &apos;__setattr__&apos; of AssertionError object&gt;
    __setstate__ = &lt;built-in method __setstate__ of AssertionError object&gt;
    __sizeof__ = &lt;built-in method __sizeof__ of AssertionError object&gt;
    __str__ = &lt;method-wrapper &apos;__str__&apos; of AssertionError object&gt;
    __subclasshook__ = &lt;built-in method __subclasshook__ of type object&gt;
    __suppress_context__ = False
    __traceback__ = &lt;traceback object&gt;
    args = ()
    with_traceback = &lt;built-in method with_traceback of AssertionError object&gt;

The above is a description of an error in a Python program.  Here is
the original traceback:

Traceback (most recent call last):
  File &quot;/contrail-test/tcutils/wrappers.py&quot;, line 80, in wrapper
    result = function(self, *args, **kwargs)
  File &quot;/contrail-test/scripts/securitygroup/test_regression_basic.py&quot;, line 91, in test_sec_group_basic
    assert vm2_fixture.verify_on_setup()
AssertionError

</failure>

    </testcase>

    <testcase classname="scripts.svc_firewall.test_svc_fw.TestSvcRegr" name="test_svc_in_net_nat_with_static_routes[sanity]" time="50.216">
      <skipped>image /contrail-test/images/tinycore-in-network-nat.qcow2 is not found</skipped>

    </testcase>

    <testcase classname="scripts.svc_firewall.test_svc_fw.TestSvcRegr" name="test_svc_v2_transparent_datapath[sanity]" time="13.934">
      <skipped>image /contrail-test/images/tinycore-net-transparent-fw.qcow2 is not found</skipped>

    </testcase>

    <testcase classname="scripts.svc_firewall.test_svc_fw_basic.TestSvcRegr" name="test_svc_CEM_22032[ci_sanity_WIP,quick_sanity,sanity,suite1]" time="12.848">
      <skipped>image /contrail-test/images/tinycore-in-network-nat.qcow2 is not found</skipped>

    </testcase>

    <testcase classname="scripts.svc_firewall.test_svc_fw_basic.TestSvcRegr" name="test_svc_in_network_datapath[ci_sanity_WIP,quick_sanity,sanity,suite1]" time="10.156">
      <skipped>image /contrail-test/images/tinycore-in-network-nat.qcow2 is not found</skipped>

    </testcase>

    <testcase classname="scripts.svc_health_check.test_svc_health_check.TestSvcHC" name="test_svc_hc_basic[sanity]" time="13.919">
      <skipped>image /contrail-test/images/tinycore-in-network-nat.qcow2 is not found</skipped>

    </testcase>

    <testcase classname="scripts.svc_health_check.test_svc_health_check.TestSvcHC" name="test_svc_trans_segment_right_hc_fail_svm[sanity]" time="14.328">
      <skipped>image /contrail-test/images/tinycore-net-transparent-fw.qcow2 is not found</skipped>

    </testcase>

    <testcase classname="scripts.svc_mirror.test_mirror.TestSVCV2Mirror" name="test_svc_v2_mirroring[ci_sanity_WIP,quick_sanity,sanity]" time="274.969">
      <failure type="testtools.testresult.real._StringException">Traceback (most recent call last):
testtools.testresult.real._StringException: Traceback (most recent call last):
  File &quot;/contrail-test/tcutils/wrappers.py&quot;, line 176, in wrapper
    raise TestFailed(&quot;\n &quot;.join(errmsg))
tcutils.cores.TestFailed: Test failed: AssertionError
Python 3.9.25: /usr/bin/python3
Mon Oct  5 04:14:54 2026

A problem occurred in a Python script.  Here is the sequence of
function calls leading up to the error, in the order they occurred.

 /contrail-test/tcutils/wrappers.py in wrapper(self=&lt;scripts.svc_mirror.test_mirror.TestSVCV2Mirror....anity_WIP,quick_sanity,sanity] id=0x7efe2147c640&gt;, *args=(), **kwargs={})
   78             log.info(&apos;Initial checks done. Running the testcase now&apos;)
   79             log.info(&apos;&apos;)
   80             result = function(self, *args, **kwargs)
   81             if self.inputs.upgrade:
   82                 pid = os.getpid()
result = None
function = &lt;function TestSVCV2Mirror.test_svc_v2_mirroring&gt;
self = &lt;scripts.svc_mirror.test_mirror.TestSVCV2Mirror....anity_WIP,quick_sanity,sanity] id=0x7efe2147c640&gt;
args = ()
kwargs = {}

 /contrail-test/scripts/svc_mirror/test_mirror.py in test_svc_v2_mirroring(self=&lt;scripts.svc_mirror.test_mirror.TestSVCV2Mirror....anity_WIP,quick_sanity,sanity] id=0x7efe2147c640&gt;)
   22     def test_svc_v2_mirroring(self):
   23         &quot;&quot;&quot;Validate the service chain mirroring&quot;&quot;&quot;
   24         return self.verify_svc_mirroring()
   25 
   26     @preposttest_wrapper
self = &lt;scripts.svc_mirror.test_mirror.TestSVCV2Mirror....anity_WIP,quick_sanity,sanity] id=0x7efe2147c640&gt;
self.verify_svc_mirroring = &lt;bound method VerifySvcMirror.verify_svc_mirrori...nity_WIP,quick_sanity,sanity] id=0x7efe2147c640&gt;&gt;

 /contrail-test/common/servicechain/mirror/verify.py in verify_svc_mirroring(self=&lt;scripts.svc_mirror.test_mirror.TestSVCV2Mirror....anity_WIP,quick_sanity,sanity] id=0x7efe2147c640&gt;, *args=(), **kwargs={})
   12 
   13     def verify_svc_mirroring(self, *args, **kwargs):
   14         ret_dict = self.config_svc_mirroring(*args, **kwargs)
   15         left_vm_fixture = ret_dict[&apos;left_vm_fixture&apos;]
   16         right_vm_fixture = ret_dict[&apos;right_vm_fixture&apos;]
ret_dict undefined
self = &lt;scripts.svc_mirror.test_mirror.TestSVCV2Mirror....anity_WIP,quick_sanity,sanity] id=0x7efe2147c640&gt;
self.config_svc_mirroring = &lt;bound method ConfigSvcMirror.config_svc_mirrori...nity_WIP,quick_sanity,sanity] id=0x7efe2147c640&gt;&gt;
args = ()
kwargs = {}

 /contrail-test/common/servicechain/mirror/config.py in config_svc_mirroring(self=&lt;scripts.svc_mirror.test_mirror.TestSVCV2Mirror....anity_WIP,quick_sanity,sanity] id=0x7efe2147c640&gt;, service_mode=&apos;transparent&apos;, *args=(), **kwargs={})
   36         vn2_fixture = self.config_vn(vn2_name, vn2_subnets)
   37 
   38         ret_dict = self.verify_svc_chain(service_mode=service_mode,
   39                                          service_type=service_type,
   40                                          left_vn_fixture=vn1_fixture,
ret_dict undefined
self = &lt;scripts.svc_mirror.test_mirror.TestSVCV2Mirror....anity_WIP,quick_sanity,sanity] id=0x7efe2147c640&gt;
self.verify_svc_chain = &lt;bound method VerifySvcChain.verify_svc_chain of...nity_WIP,quick_sanity,sanity] id=0x7efe2147c640&gt;&gt;
service_mode = &apos;transparent&apos;
service_type = &apos;analyzer&apos;
left_vn_fixture undefined
vn1_fixture = &lt;vn_test.VNFixture object&gt;
right_vn_fixture undefined
vn2_fixture = &lt;vn_test.VNFixture object&gt;
create_svms = True
kwargs = {}

 /contrail-test/common/servicechain/verify.py in verify_svc_chain(self=&lt;scripts.svc_mirror.test_mirror.TestSVCV2Mirror....anity_WIP,quick_sanity,sanity] id=0x7efe2147c640&gt;, *args=(), **kwargs={&apos;create_svms&apos;: True, &apos;left_vn_fixture&apos;: &lt;vn_test.VNFixture object&gt;, &apos;right_vn_fixture&apos;: &lt;vn_test.VNFixture object&gt;, &apos;service_mode&apos;: &apos;transparent&apos;, &apos;service_type&apos;: &apos;analyzer&apos;})
  318     def verify_svc_chain(self, *args, **kwargs):
  319         svc_chain_info = kwargs.get(&apos;svc_chain_info&apos;)
  320         ret_dict = svc_chain_info or self.config_svc_chain(*args, **kwargs)
  321         proto = kwargs.get(&apos;proto&apos;, &apos;any&apos;)
  322         left_vn_fq_name = ret_dict.get(&apos;left_vn_fixture&apos;).vn_fq_name
ret_dict undefined
svc_chain_info = None
self = &lt;scripts.svc_mirror.test_mirror.TestSVCV2Mirror....anity_WIP,quick_sanity,sanity] id=0x7efe2147c640&gt;
self.config_svc_chain = &lt;bound method ConfigSvcChain.config_svc_chain of...nity_WIP,quick_sanity,sanity] id=0x7efe2147c640&gt;&gt;
args = ()
kwargs = {&apos;create_svms&apos;: True, &apos;left_vn_fixture&apos;: &lt;vn_test.VNFixture object&gt;, &apos;right_vn_fixture&apos;: &lt;vn_test.VNFixture object&gt;, &apos;service_mode&apos;: &apos;transparent&apos;, &apos;service_type&apos;: &apos;analyzer&apos;}

 /contrail-test/common/servicechain/config.py in config_svc_chain(self=&lt;scripts.svc_mirror.test_mirror.TestSVCV2Mirror....anity_WIP,quick_sanity,sanity] id=0x7efe2147c640&gt;, service_mode=&apos;transparent&apos;, service_type=&apos;analyzer&apos;, max_inst=1, proto=&apos;any&apos;, svc_chain_type=&apos;parallel&apos;, src_ports=[0, 65535], dst_ports=[0, 65535], svc_img_name=&apos;ubuntu&apos;, st_version=2, mgmt_vn_name=&apos;ctest-mgmt_vn-59705736&apos;, mgmt_vn_subnets=[&apos;150.57.91.128/26&apos;], mgmt_vn_fixture=&lt;vn_test.VNFixture object&gt;, left_vn_name=&apos;ctest-left-67658520&apos;, left_vn_subnets=[&apos;148.11.213.192/26&apos;], left_vn_fixture=&lt;vn_test.VNFixture object&gt;, right_vn_name=&apos;ctest-right-03952265&apos;, right_vn_subnets=[&apos;133.18.128.128/26&apos;], right_vn_fixture=&lt;vn_test.VNFixture object&gt;, left_lr_child_vn_fixture=None, right_lr_child_vn_fixture=None, left_vm_name=&apos;ctest-left_vm-33263914&apos;, left_vm_fixture=&lt;VMFixture: ctest-left_vm-33263914&gt;, right_vm_name=&apos;ctest-right_vm-48504918&apos;, right_vm_fixture=&lt;VMFixture: ctest-right_vm-48504918&gt;, image_name=&apos;ubuntu-traffic&apos;, policy_fixture=None, st_fixture=&lt;svc_template_fixture.SvcTemplateFixture object&gt;, si_fixture=&lt;svc_instance_fixture.SvcInstanceFixture object&gt;, port_tuples_props=None, static_route=None, svm_fixtures=[&lt;VMFixture: ctest-pt_svm0-42955425&gt;], create_svms=True, evpn=False, modify_rules=False, policy_action=&apos;pass&apos;, hosts=[], **kwargs={})
  580             self.verify_vm(left_vm_fixture)
  581         if created_right_vm:
  582             self.verify_vm(right_vm_fixture)
  583 
  584 
self = &lt;scripts.svc_mirror.test_mirror.TestSVCV2Mirror....anity_WIP,quick_sanity,sanity] id=0x7efe2147c640&gt;
self.verify_vm = &lt;bound method ConfigSvcChain.verify_vm of &lt;scrip...nity_WIP,quick_sanity,sanity] id=0x7efe2147c640&gt;&gt;
right_vm_fixture = &lt;VMFixture: ctest-right_vm-48504918&gt;

 /contrail-test/common/servicechain/config.py in verify_vm(self=&lt;scripts.svc_mirror.test_mirror.TestSVCV2Mirror....anity_WIP,quick_sanity,sanity] id=0x7efe2147c640&gt;, vm_fixture=&lt;VMFixture: ctest-right_vm-48504918&gt;)
  173 
  174     def verify_vm(self, vm_fixture):
  175         assert vm_fixture.wait_till_vm_is_up(), &apos;VM does not seem to be up&apos;
  176     # end verify_vm
  177 
vm_fixture = &lt;VMFixture: ctest-right_vm-48504918&gt;
vm_fixture.wait_till_vm_is_up = &lt;bound method VMFixture.wait_till_vm_is_up of &lt;VMFixture: ctest-right_vm-48504918&gt;&gt;
AssertionError: VM does not seem to be up
    __cause__ = None
    __class__ = &lt;class &apos;AssertionError&apos;&gt;
    __context__ = None
    __delattr__ = &lt;method-wrapper &apos;__delattr__&apos; of AssertionError object&gt;
    __dict__ = {}
    __dir__ = &lt;built-in method __dir__ of AssertionError object&gt;
    __doc__ = &apos;Assertion failed.&apos;
    __eq__ = &lt;method-wrapper &apos;__eq__&apos; of AssertionError object&gt;
    __format__ = &lt;built-in method __format__ of AssertionError object&gt;
    __ge__ = &lt;method-wrapper &apos;__ge__&apos; of AssertionError object&gt;
    __getattribute__ = &lt;method-wrapper &apos;__getattribute__&apos; of AssertionError object&gt;
    __gt__ = &lt;method-wrapper &apos;__gt__&apos; of AssertionError object&gt;
    __hash__ = &lt;method-wrapper &apos;__hash__&apos; of AssertionError object&gt;
    __init__ = &lt;method-wrapper &apos;__init__&apos; of AssertionError object&gt;
    __init_subclass__ = &lt;built-in method __init_subclass__ of type object&gt;
    __le__ = &lt;method-wrapper &apos;__le__&apos; of AssertionError object&gt;
    __lt__ = &lt;method-wrapper &apos;__lt__&apos; of AssertionError object&gt;
    __ne__ = &lt;method-wrapper &apos;__ne__&apos; of AssertionError object&gt;
    __new__ = &lt;built-in method __new__ of type object&gt;
    __reduce__ = &lt;built-in method __reduce__ of AssertionError object&gt;
    __reduce_ex__ = &lt;built-in method __reduce_ex__ of AssertionError object&gt;
    __repr__ = &lt;method-wrapper &apos;__repr__&apos; of AssertionError object&gt;
    __setattr__ = &lt;method-wrapper &apos;__setattr__&apos; of AssertionError object&gt;
    __setstate__ = &lt;built-in method __setstate__ of AssertionError object&gt;
    __sizeof__ = &lt;built-in method __sizeof__ of AssertionError object&gt;
    __str__ = &lt;method-wrapper &apos;__str__&apos; of AssertionError object&gt;
    __subclasshook__ = &lt;built-in method __subclasshook__ of type object&gt;
    __suppress_context__ = False
    __traceback__ = &lt;traceback object&gt;
    args = (&apos;VM does not seem to be up&apos;,)
    with_traceback = &lt;built-in method with_traceback of AssertionError object&gt;

The above is a description of an error in a Python program.  Here is
the original traceback:

Traceback (most recent call last):
  File &quot;/contrail-test/tcutils/wrappers.py&quot;, line 80, in wrapper
    result = function(self, *args, **kwargs)
  File &quot;/contrail-test/scripts/svc_mirror/test_mirror.py&quot;, line 24, in test_svc_v2_mirroring
    return self.verify_svc_mirroring()
  File &quot;/contrail-test/common/servicechain/mirror/verify.py&quot;, line 14, in verify_svc_mirroring
    ret_dict = self.config_svc_mirroring(*args, **kwargs)
  File &quot;/contrail-test/common/servicechain/mirror/config.py&quot;, line 38, in config_svc_mirroring
    ret_dict = self.verify_svc_chain(service_mode=service_mode,
  File &quot;/contrail-test/common/servicechain/verify.py&quot;, line 320, in verify_svc_chain
    ret_dict = svc_chain_info or self.config_svc_chain(*args, **kwargs)
  File &quot;/contrail-test/common/servicechain/config.py&quot;, line 582, in config_svc_chain
    self.verify_vm(right_vm_fixture)
  File &quot;/contrail-test/common/servicechain/config.py&quot;, line 175, in verify_vm
    assert vm_fixture.wait_till_vm_is_up(), &apos;VM does not seem to be up&apos;
AssertionError: VM does not seem to be up

</failure>

    </testcase>

    <testcase classname="scripts.vdns.test_vdns_basic.TestvDNSBasic0" name="test_vdns_ping_same_vn[ci_sanity,sanity,suite1]" time="250.024">
      <failure type="testtools.testresult.real._StringException">Traceback (most recent call last):
testtools.testresult.real._StringException: stderr: {{{Warning: sudo() received nonzero return code 1 while executing &apos;python -c &apos;import socket;socket.getaddrinfo(&quot;ctest-vm1-test-36217674&quot;, None, socket.AF_INET6)&apos;&apos;!}}}
stdout: {{{
[ubuntu@169.254.0.3] run: ifconfig | grep 10.10.10.3
[ubuntu@169.254.0.3] run: ifconfig | grep 10.10.10.3
[ubuntu@169.254.0.3] out:           inet addr:10.10.10.3  Bcast:10.10.10.255  Mask:255.255.255.0
[ubuntu@169.254.0.3] out: 

[ubuntu@169.254.0.3] sudo: python -c &apos;import socket;socket.getaddrinfo(&quot;ctest-vm1-test-36217674&quot;, None, socket.AF_INET6)&apos;
[ubuntu@169.254.0.3] out: Traceback (most recent call last):
[ubuntu@169.254.0.3] out:   File &quot;&lt;string&gt;&quot;, line 1, in &lt;module&gt;
[ubuntu@169.254.0.3] out: socket.gaierror: [Errno -5] No address associated with hostname
[ubuntu@169.254.0.3] out: 

[ubuntu@169.254.0.3] sudo: ping -s 56 -c 3 -W 1  ctest-vm1-test-36217674
[ubuntu@169.254.0.3] out: PING ctest-vm1-test-36217674.juniper.net (10.10.10.3) 56(84) bytes of data.
[ubuntu@169.254.0.3] out: 64 bytes from ctest-vm1-test-36217674.juniper.net (10.10.10.3): icmp_req=1 ttl=64 time=2.24 ms
[ubuntu@169.254.0.3] out: 64 bytes from ctest-vm1-test-36217674.juniper.net (10.10.10.3): icmp_req=2 ttl=64 time=0.275 ms
[ubuntu@169.254.0.3] out: 64 bytes from ctest-vm1-test-36217674.juniper.net (10.10.10.3): icmp_req=3 ttl=64 time=0.213 ms
[ubuntu@169.254.0.3] out: 
[ubuntu@169.254.0.3] out: --- ctest-vm1-test-36217674.juniper.net ping statistics ---
[ubuntu@169.254.0.3] out: 3 packets transmitted, 3 received, 0% packet loss, time 2004ms
[ubuntu@169.254.0.3] out: rtt min/avg/max/mdev = 0.213/0.911/2.245/0.943 ms
[ubuntu@169.254.0.3] out:
}}}

Traceback (most recent call last):
  File &quot;/contrail-test/tcutils/util.py&quot;, line 1041, in wrapper
    return f(self, *func_args, **func_kwargs)
  File &quot;/contrail-test/tcutils/wrappers.py&quot;, line 176, in wrapper
    raise TestFailed(&quot;\n &quot;.join(errmsg))
tcutils.cores.TestFailed: Test failed: AssertionError
Python 3.9.25: /usr/bin/python3
Mon Oct  5 04:19:08 2026

A problem occurred in a Python script.  Here is the sequence of
function calls leading up to the error, in the order they occurred.

 /contrail-test/tcutils/wrappers.py in wrapper(self=&lt;scripts.vdns.test_vdns_basic.TestvDNSBasic0.tes...me_vn[ci_sanity,sanity,suite1] id=0x7efe214955e0&gt;, *args=(), **kwargs={})
   78             log.info(&apos;Initial checks done. Running the testcase now&apos;)
   79             log.info(&apos;&apos;)
   80             result = function(self, *args, **kwargs)
   81             if self.inputs.upgrade:
   82                 pid = os.getpid()
result = None
function = &lt;function TestvDNSBasic0.test_vdns_ping_same_vn&gt;
self = &lt;scripts.vdns.test_vdns_basic.TestvDNSBasic0.tes...me_vn[ci_sanity,sanity,suite1] id=0x7efe214955e0&gt;
args = ()
kwargs = {}

 /contrail-test/scripts/vdns/test_vdns_basic.py in test_vdns_ping_same_vn(self=&lt;scripts.vdns.test_vdns_basic.TestvDNSBasic0.tes...me_vn[ci_sanity,sanity,suite1] id=0x7efe214955e0&gt;)
   94             vm_fixture[vm_name] = self.useFixture(
   95                 VMFixture(project_name=self.inputs.project_name, connections=self.connections, vn_obj=vn_quantum_obj, vm_name=vm_name,image_name=&apos;ubuntu-traffic&apos;))
   96             assert vm_fixture[vm_name].wait_till_vm_is_up(), (&apos;VM %s&apos;
   97                 &apos; failed to come up&apos; % (vm_name))
   98             vm_ip = vm_fixture[vm_name].get_vm_ip_from_vm(
vm_fixture = {&apos;ctest-vm1-test-36217674&apos;: &lt;VMFixture: ctest-vm1-test-36217674&gt;, &apos;ctest-vm2-test-39419965&apos;: &lt;VMFixture: ctest-vm2-test-39419965&gt;}
vm_name = &apos;ctest-vm2-test-39419965&apos;
].wait_till_vm_is_up undefined
AssertionError: VM ctest-vm2-test-39419965 failed to come up
    __cause__ = None
    __class__ = &lt;class &apos;AssertionError&apos;&gt;
    __context__ = None
    __delattr__ = &lt;method-wrapper &apos;__delattr__&apos; of AssertionError object&gt;
    __dict__ = {}
    __dir__ = &lt;built-in method __dir__ of AssertionError object&gt;
    __doc__ = &apos;Assertion failed.&apos;
    __eq__ = &lt;method-wrapper &apos;__eq__&apos; of AssertionError object&gt;
    __format__ = &lt;built-in method __format__ of AssertionError object&gt;
    __ge__ = &lt;method-wrapper &apos;__ge__&apos; of AssertionError object&gt;
    __getattribute__ = &lt;method-wrapper &apos;__getattribute__&apos; of AssertionError object&gt;
    __gt__ = &lt;method-wrapper &apos;__gt__&apos; of AssertionError object&gt;
    __hash__ = &lt;method-wrapper &apos;__hash__&apos; of AssertionError object&gt;
    __init__ = &lt;method-wrapper &apos;__init__&apos; of AssertionError object&gt;
    __init_subclass__ = &lt;built-in method __init_subclass__ of type object&gt;
    __le__ = &lt;method-wrapper &apos;__le__&apos; of AssertionError object&gt;
    __lt__ = &lt;method-wrapper &apos;__lt__&apos; of AssertionError object&gt;
    __ne__ = &lt;method-wrapper &apos;__ne__&apos; of AssertionError object&gt;
    __new__ = &lt;built-in method __new__ of type object&gt;
    __reduce__ = &lt;built-in method __reduce__ of AssertionError object&gt;
    __reduce_ex__ = &lt;built-in method __reduce_ex__ of AssertionError object&gt;
    __repr__ = &lt;method-wrapper &apos;__repr__&apos; of AssertionError object&gt;
    __setattr__ = &lt;method-wrapper &apos;__setattr__&apos; of AssertionError object&gt;
    __setstate__ = &lt;built-in method __setstate__ of AssertionError object&gt;
    __sizeof__ = &lt;built-in method __sizeof__ of AssertionError object&gt;
    __str__ = &lt;method-wrapper &apos;__str__&apos; of AssertionError object&gt;
    __subclasshook__ = &lt;built-in method __subclasshook__ of type object&gt;
    __suppress_context__ = False
    __traceback__ = &lt;traceback object&gt;
    args = (&apos;VM ctest-vm2-test-39419965 failed to come up&apos;,)
    with_traceback = &lt;built-in method with_traceback of AssertionError object&gt;

The above is a description of an error in a Python program.  Here is
the original traceback:

Traceback (most recent call last):
  File &quot;/contrail-test/tcutils/wrappers.py&quot;, line 80, in wrapper
    result = function(self, *args, **kwargs)
  File &quot;/contrail-test/scripts/vdns/test_vdns_basic.py&quot;, line 96, in test_vdns_ping_same_vn
    assert vm_fixture[vm_name].wait_till_vm_is_up(), (&apos;VM %s&apos;
AssertionError: VM ctest-vm2-test-39419965 failed to come up

</failure>

    </testcase>

    <testcase classname="scripts.vm_regression.test_vm.TestBasicVMVNx" name="test_sctp_traffic_between_vm[sanity]" time="648.511">
      <failure type="testtools.testresult.real._StringException">Traceback (most recent call last):
testtools.testresult.real._StringException: stdout: {{{
[localhost] local: mkdir -p /contrail-test/images
[localhost] local: wget -nv http://nexus.opensdn.io/repository///images/converts//ubuntu-sctp.vmdk.gz -O /contrail-test/images/ubuntu-sctp.vmdk.gz
[localhost] local: gunzip -f /contrail-test/images/ubuntu-sctp.vmdk.gz
[localhost] local: rm -f /contrail-test/images/ubuntu-sctp.vmdk
}}}

Traceback (most recent call last):
  File &quot;/contrail-test/tcutils/util.py&quot;, line 1041, in wrapper
    return f(self, *func_args, **func_kwargs)
  File &quot;/contrail-test/tcutils/wrappers.py&quot;, line 176, in wrapper
    raise TestFailed(&quot;\n &quot;.join(errmsg))
tcutils.cores.TestFailed: Test failed: &lt;pre&gt;Traceback (most recent call last):
  File &quot;/contrail-test/tcutils/wrappers.py&quot;, line 80, in wrapper
    result = function(self, *args, **kwargs)
  File &quot;/contrail-test/scripts/vm_regression/test_vm.py&quot;, line 3030, in test_sctp_traffic_between_vm
    if not vn1_vm1_fixture.ping_with_certainty(fvn_vm1_fixture.vm_ip):
  File &quot;/contrail-test/fixtures/vm_test.py&quot;, line 354, in vm_ip
    assert self.verify_vm_launched()
AssertionError
&lt;/pre&gt;

</failure>

    </testcase>

    <testcase classname="scripts.vm_regression.test_vm_basic.TestBasicVMVN" name="test_generic_link_local_service[cb_sanity,ci_contrail_go_kolla_ocata_sanity,ci_sanity,dev_sanity_dpdk,sanity,suite1]" time="45.600" />

    <testcase classname="scripts.vm_regression.test_vm_basic.TestBasicVMVN" name="test_metadata_service[cb_sanity,ci_sanity,sanity,suite1]" time="156.944">
      <failure type="testtools.testresult.real._StringException">Traceback (most recent call last):
testtools.testresult.real._StringException: Traceback (most recent call last):
  File &quot;/contrail-test/tcutils/wrappers.py&quot;, line 176, in wrapper
    raise TestFailed(&quot;\n &quot;.join(errmsg))
tcutils.cores.TestFailed: Test failed: AssertionError
Python 3.9.25: /usr/bin/python3
Mon Oct  5 04:33:32 2026

A problem occurred in a Python script.  Here is the sequence of
function calls leading up to the error, in the order they occurred.

 /contrail-test/tcutils/wrappers.py in wrapper(self=&lt;scripts.vm_regression.test_vm_basic.TestBasicVM...anity,ci_sanity,sanity,suite1] id=0x7efe213eeb20&gt;, *args=(), **kwargs={})
   78             log.info(&apos;Initial checks done. Running the testcase now&apos;)
   79             log.info(&apos;&apos;)
   80             result = function(self, *args, **kwargs)
   81             if self.inputs.upgrade:
   82                 pid = os.getpid()
result = None
function = &lt;function TestBasicVMVN.test_metadata_service&gt;
self = &lt;scripts.vm_regression.test_vm_basic.TestBasicVM...anity,ci_sanity,sanity,suite1] id=0x7efe213eeb20&gt;
args = ()
kwargs = {}

 /contrail-test/scripts/vm_regression/test_vm_basic.py in test_metadata_service(self=&lt;scripts.vm_regression.test_vm_basic.TestBasicVM...anity,ci_sanity,sanity,suite1] id=0x7efe213eeb20&gt;)
   55                                      image_name=&apos;cirros&apos;,
   56                                      userdata=&apos;/tmp/metadata_script.txt&apos;)
   57         assert vm1_fixture.wait_till_vm_is_up()
   58 
   59         cmd = &apos;cat /tmp/output.txt&apos;
vm1_fixture = &lt;VMFixture: ctest-TestBasicVMVN-06923401-51247530&gt;
vm1_fixture.wait_till_vm_is_up = &lt;bound method VMFixture.wait_till_vm_is_up of &lt;VMFixture: ctest-TestBasicVMVN-06923401-51247530&gt;&gt;
AssertionError: 
    __cause__ = None
    __class__ = &lt;class &apos;AssertionError&apos;&gt;
    __context__ = None
    __delattr__ = &lt;method-wrapper &apos;__delattr__&apos; of AssertionError object&gt;
    __dict__ = {}
    __dir__ = &lt;built-in method __dir__ of AssertionError object&gt;
    __doc__ = &apos;Assertion failed.&apos;
    __eq__ = &lt;method-wrapper &apos;__eq__&apos; of AssertionError object&gt;
    __format__ = &lt;built-in method __format__ of AssertionError object&gt;
    __ge__ = &lt;method-wrapper &apos;__ge__&apos; of AssertionError object&gt;
    __getattribute__ = &lt;method-wrapper &apos;__getattribute__&apos; of AssertionError object&gt;
    __gt__ = &lt;method-wrapper &apos;__gt__&apos; of AssertionError object&gt;
    __hash__ = &lt;method-wrapper &apos;__hash__&apos; of AssertionError object&gt;
    __init__ = &lt;method-wrapper &apos;__init__&apos; of AssertionError object&gt;
    __init_subclass__ = &lt;built-in method __init_subclass__ of type object&gt;
    __le__ = &lt;method-wrapper &apos;__le__&apos; of AssertionError object&gt;
    __lt__ = &lt;method-wrapper &apos;__lt__&apos; of AssertionError object&gt;
    __ne__ = &lt;method-wrapper &apos;__ne__&apos; of AssertionError object&gt;
    __new__ = &lt;built-in method __new__ of type object&gt;
    __reduce__ = &lt;built-in method __reduce__ of AssertionError object&gt;
    __reduce_ex__ = &lt;built-in method __reduce_ex__ of AssertionError object&gt;
    __repr__ = &lt;method-wrapper &apos;__repr__&apos; of AssertionError object&gt;
    __setattr__ = &lt;method-wrapper &apos;__setattr__&apos; of AssertionError object&gt;
    __setstate__ = &lt;built-in method __setstate__ of AssertionError object&gt;
    __sizeof__ = &lt;built-in method __sizeof__ of AssertionError object&gt;
    __str__ = &lt;method-wrapper &apos;__str__&apos; of AssertionError object&gt;
    __subclasshook__ = &lt;built-in method __subclasshook__ of type object&gt;
    __suppress_context__ = False
    __traceback__ = &lt;traceback object&gt;
    args = ()
    with_traceback = &lt;built-in method with_traceback of AssertionError object&gt;

The above is a description of an error in a Python program.  Here is
the original traceback:

Traceback (most recent call last):
  File &quot;/contrail-test/tcutils/wrappers.py&quot;, line 80, in wrapper
    result = function(self, *args, **kwargs)
  File &quot;/contrail-test/scripts/vm_regression/test_vm_basic.py&quot;, line 57, in test_metadata_service
    assert vm1_fixture.wait_till_vm_is_up()
AssertionError

</failure>

    </testcase>

    <testcase classname="scripts.vm_regression.test_vm_basic.TestBasicVMVN" name="test_ping_within_vn_two_vms_two_different_subnets[ci_contrail_go_kolla_ocata_sanity,ci_sanity,sanity,suite1]" time="213.436">
      <failure type="testtools.testresult.real._StringException">Traceback (most recent call last):
testtools.testresult.real._StringException: Traceback (most recent call last):
  File &quot;/contrail-test/tcutils/wrappers.py&quot;, line 176, in wrapper
    raise TestFailed(&quot;\n &quot;.join(errmsg))
tcutils.cores.TestFailed: Test failed: AssertionError
Python 3.9.25: /usr/bin/python3
Mon Oct  5 04:37:02 2026

A problem occurred in a Python script.  Here is the sequence of
function calls leading up to the error, in the order they occurred.

 /contrail-test/tcutils/wrappers.py in wrapper(self=&lt;scripts.vm_regression.test_vm_basic.TestBasicVM...anity,ci_sanity,sanity,suite1] id=0x7efe213eef40&gt;, *args=(), **kwargs={})
   78             log.info(&apos;Initial checks done. Running the testcase now&apos;)
   79             log.info(&apos;&apos;)
   80             result = function(self, *args, **kwargs)
   81             if self.inputs.upgrade:
   82                 pid = os.getpid()
result = None
function = &lt;function TestBasicVMVN.test_ping_within_vn_two_vms_two_different_subnets&gt;
self = &lt;scripts.vm_regression.test_vm_basic.TestBasicVM...anity,ci_sanity,sanity,suite1] id=0x7efe213eef40&gt;
args = ()
kwargs = {}

 /contrail-test/scripts/vm_regression/test_vm_basic.py in test_ping_within_vn_two_vms_two_different_subnets(self=&lt;scripts.vm_regression.test_vm_basic.TestBasicVM...anity,ci_sanity,sanity,suite1] id=0x7efe213eef40&gt;)
  146         assert vn1_fixture.verify_on_setup()
  147         assert vm1.wait_till_vm_is_up()
  148         assert vm2.wait_till_vm_is_up()
  149         assert vm3.wait_till_vm_is_up()
  150         assert vm1.ping_to_ip(vm2.vm_ip)
vm2 = &lt;VMFixture: ctest-TestBasicVMVN-06923401-91594560&gt;
vm2.wait_till_vm_is_up = &lt;bound method VMFixture.wait_till_vm_is_up of &lt;VMFixture: ctest-TestBasicVMVN-06923401-91594560&gt;&gt;
AssertionError: 
    __cause__ = None
    __class__ = &lt;class &apos;AssertionError&apos;&gt;
    __context__ = None
    __delattr__ = &lt;method-wrapper &apos;__delattr__&apos; of AssertionError object&gt;
    __dict__ = {}
    __dir__ = &lt;built-in method __dir__ of AssertionError object&gt;
    __doc__ = &apos;Assertion failed.&apos;
    __eq__ = &lt;method-wrapper &apos;__eq__&apos; of AssertionError object&gt;
    __format__ = &lt;built-in method __format__ of AssertionError object&gt;
    __ge__ = &lt;method-wrapper &apos;__ge__&apos; of AssertionError object&gt;
    __getattribute__ = &lt;method-wrapper &apos;__getattribute__&apos; of AssertionError object&gt;
    __gt__ = &lt;method-wrapper &apos;__gt__&apos; of AssertionError object&gt;
    __hash__ = &lt;method-wrapper &apos;__hash__&apos; of AssertionError object&gt;
    __init__ = &lt;method-wrapper &apos;__init__&apos; of AssertionError object&gt;
    __init_subclass__ = &lt;built-in method __init_subclass__ of type object&gt;
    __le__ = &lt;method-wrapper &apos;__le__&apos; of AssertionError object&gt;
    __lt__ = &lt;method-wrapper &apos;__lt__&apos; of AssertionError object&gt;
    __ne__ = &lt;method-wrapper &apos;__ne__&apos; of AssertionError object&gt;
    __new__ = &lt;built-in method __new__ of type object&gt;
    __reduce__ = &lt;built-in method __reduce__ of AssertionError object&gt;
    __reduce_ex__ = &lt;built-in method __reduce_ex__ of AssertionError object&gt;
    __repr__ = &lt;method-wrapper &apos;__repr__&apos; of AssertionError object&gt;
    __setattr__ = &lt;method-wrapper &apos;__setattr__&apos; of AssertionError object&gt;
    __setstate__ = &lt;built-in method __setstate__ of AssertionError object&gt;
    __sizeof__ = &lt;built-in method __sizeof__ of AssertionError object&gt;
    __str__ = &lt;method-wrapper &apos;__str__&apos; of AssertionError object&gt;
    __subclasshook__ = &lt;built-in method __subclasshook__ of type object&gt;
    __suppress_context__ = False
    __traceback__ = &lt;traceback object&gt;
    args = ()
    with_traceback = &lt;built-in method with_traceback of AssertionError object&gt;

The above is a description of an error in a Python program.  Here is
the original traceback:

Traceback (most recent call last):
  File &quot;/contrail-test/tcutils/wrappers.py&quot;, line 80, in wrapper
    result = function(self, *args, **kwargs)
  File &quot;/contrail-test/scripts/vm_regression/test_vm_basic.py&quot;, line 148, in test_ping_within_vn_two_vms_two_different_subnets
    assert vm2.wait_till_vm_is_up()
AssertionError

</failure>

    </testcase>

    <testcase classname="scripts.vrouter.test_disable_policy.DisablePolicyEcmpIpv6" name="test_ecmp_with_static_routes[cb_sanity,dev_reg,sanity]" time="166.886">
      <failure type="testtools.testresult.real._StringException">Traceback (most recent call last):
testtools.testresult.real._StringException: Traceback (most recent call last):
  File &quot;/contrail-test/tcutils/util.py&quot;, line 1041, in wrapper
    return f(self, *func_args, **func_kwargs)
  File &quot;/contrail-test/scripts/vrouter/test_disable_policy.py&quot;, line 735, in test_ecmp_with_static_routes
    super(DisablePolicyEcmpIpv6, self).test_ecmp_with_static_routes()
  File &quot;/contrail-test/tcutils/util.py&quot;, line 1041, in wrapper
    return f(self, *func_args, **func_kwargs)
  File &quot;/contrail-test/tcutils/wrappers.py&quot;, line 176, in wrapper
    raise TestFailed(&quot;\n &quot;.join(errmsg))
tcutils.cores.TestFailed: Test failed: AssertionError
Python 3.9.25: /usr/bin/python3
Mon Oct  5 04:39:52 2026

A problem occurred in a Python script.  Here is the sequence of
function calls leading up to the error, in the order they occurred.

 /contrail-test/tcutils/wrappers.py in wrapper(self=&lt;scripts.vrouter.test_disable_policy.DisablePoli...utes[cb_sanity,dev_reg,sanity] id=0x7efe213feb20&gt;, *args=(), **kwargs={})
   78             log.info(&apos;Initial checks done. Running the testcase now&apos;)
   79             log.info(&apos;&apos;)
   80             result = function(self, *args, **kwargs)
   81             if self.inputs.upgrade:
   82                 pid = os.getpid()
result = None
function = &lt;function DisablePolicyEcmp.test_ecmp_with_static_routes&gt;
self = &lt;scripts.vrouter.test_disable_policy.DisablePoli...utes[cb_sanity,dev_reg,sanity] id=0x7efe213feb20&gt;
args = ()
kwargs = {}

 /contrail-test/scripts/vrouter/test_disable_policy.py in test_ecmp_with_static_routes(self=&lt;scripts.vrouter.test_disable_policy.DisablePoli...utes[cb_sanity,dev_reg,sanity] id=0x7efe213feb20&gt;)
   63             node_name=compute_hosts[0], image_name=image)[0]
   64 
   65         self.verify_vms(vm_fixtures)
   66         self.verify_vms(vm1_fixture)
   67         vm1_fixture = vm1_fixture[0]
self = &lt;scripts.vrouter.test_disable_policy.DisablePoli...utes[cb_sanity,dev_reg,sanity] id=0x7efe213feb20&gt;
self.verify_vms = &lt;bound method BaseVrouterTest.verify_vms of &lt;scr...tes[cb_sanity,dev_reg,sanity] id=0x7efe213feb20&gt;&gt;
vm_fixtures = [&lt;VMFixture: ctest-DisablePolicyEcmpIpv6-38404315-22678010&gt;, &lt;VMFixture: ctest-DisablePolicyEcmpIpv6-38404315-59909840&gt;]

 /contrail-test/common/vrouter/base.py in verify_vms(self=&lt;scripts.vrouter.test_disable_policy.DisablePoli...utes[cb_sanity,dev_reg,sanity] id=0x7efe213feb20&gt;, vm_fixtures=[&lt;VMFixture: ctest-DisablePolicyEcmpIpv6-38404315-22678010&gt;, &lt;VMFixture: ctest-DisablePolicyEcmpIpv6-38404315-59909840&gt;])
  198     def verify_vms(self, vm_fixtures):
  199         for vm_fixture in vm_fixtures:
  200             assert vm_fixture.wait_till_vm_is_up()
  201 
  202     def add_static_routes_on_vms(self,prefix, vm_fixtures, ip=None):
vm_fixture = &lt;VMFixture: ctest-DisablePolicyEcmpIpv6-38404315-22678010&gt;
vm_fixture.wait_till_vm_is_up = &lt;bound method VMFixture.wait_till_vm_is_up of &lt;V...: ctest-DisablePolicyEcmpIpv6-38404315-22678010&gt;&gt;
AssertionError: 
    __cause__ = None
    __class__ = &lt;class &apos;AssertionError&apos;&gt;
    __context__ = None
    __delattr__ = &lt;method-wrapper &apos;__delattr__&apos; of AssertionError object&gt;
    __dict__ = {}
    __dir__ = &lt;built-in method __dir__ of AssertionError object&gt;
    __doc__ = &apos;Assertion failed.&apos;
    __eq__ = &lt;method-wrapper &apos;__eq__&apos; of AssertionError object&gt;
    __format__ = &lt;built-in method __format__ of AssertionError object&gt;
    __ge__ = &lt;method-wrapper &apos;__ge__&apos; of AssertionError object&gt;
    __getattribute__ = &lt;method-wrapper &apos;__getattribute__&apos; of AssertionError object&gt;
    __gt__ = &lt;method-wrapper &apos;__gt__&apos; of AssertionError object&gt;
    __hash__ = &lt;method-wrapper &apos;__hash__&apos; of AssertionError object&gt;
    __init__ = &lt;method-wrapper &apos;__init__&apos; of AssertionError object&gt;
    __init_subclass__ = &lt;built-in method __init_subclass__ of type object&gt;
    __le__ = &lt;method-wrapper &apos;__le__&apos; of AssertionError object&gt;
    __lt__ = &lt;method-wrapper &apos;__lt__&apos; of AssertionError object&gt;
    __ne__ = &lt;method-wrapper &apos;__ne__&apos; of AssertionError object&gt;
    __new__ = &lt;built-in method __new__ of type object&gt;
    __reduce__ = &lt;built-in method __reduce__ of AssertionError object&gt;
    __reduce_ex__ = &lt;built-in method __reduce_ex__ of AssertionError object&gt;
    __repr__ = &lt;method-wrapper &apos;__repr__&apos; of AssertionError object&gt;
    __setattr__ = &lt;method-wrapper &apos;__setattr__&apos; of AssertionError object&gt;
    __setstate__ = &lt;built-in method __setstate__ of AssertionError object&gt;
    __sizeof__ = &lt;built-in method __sizeof__ of AssertionError object&gt;
    __str__ = &lt;method-wrapper &apos;__str__&apos; of AssertionError object&gt;
    __subclasshook__ = &lt;built-in method __subclasshook__ of type object&gt;
    __suppress_context__ = False
    __traceback__ = &lt;traceback object&gt;
    args = ()
    with_traceback = &lt;built-in method with_traceback of AssertionError object&gt;

The above is a description of an error in a Python program.  Here is
the original traceback:

Traceback (most recent call last):
  File &quot;/contrail-test/tcutils/wrappers.py&quot;, line 80, in wrapper
    result = function(self, *args, **kwargs)
  File &quot;/contrail-test/scripts/vrouter/test_disable_policy.py&quot;, line 65, in test_ecmp_with_static_routes
    self.verify_vms(vm_fixtures)
  File &quot;/contrail-test/common/vrouter/base.py&quot;, line 200, in verify_vms
    assert vm_fixture.wait_till_vm_is_up()
AssertionError

</failure>

    </testcase>

    <testcase classname="scripts.vrouter.test_dpdk_bond_lacp.TestLacp" name="test_bond_lacp_config[dev_reg,sanity]" time="2.668">
      <skipped>Skipped as test is not supported if dpdk_cluster=False </skipped>

    </testcase>

    <testcase classname="scripts.vrouter.test_dpdk_bond_status.TestDpdkBondStatus" name="test_dpdk_bond_status[dev_reg,sanity]" time="2.686">
      <skipped>Skipped as test is not supported if dpdk_cluster=False </skipped>

    </testcase>

    <testcase classname="scripts.vrouter.test_dpdk_fbit_disable_mbuf.TestFbitMergeBuffDisable" name="test_fbit_disable_mbuf_dpdk[dev_reg,sanity]" time="2.647">
      <skipped>Skipped as test is not supported if dpdk_cluster=False </skipped>

    </testcase>

    <testcase classname="scripts.vrouter.test_dpdk_gro_gso.TestGroGso" name="test_dpdk_gro_gso[dev_reg,sanity]" time="2.724">
      <skipped>Skipped as test is not supported if dpdk_cluster=False </skipped>

    </testcase>

    <testcase classname="scripts.vrouter.test_dpdk_vhost_mtu.TestMtu" name="test_mtu_config[dev_reg,sanity]" time="2.659">
      <skipped>Skipped as test is not supported if dpdk_cluster=False </skipped>

    </testcase>

    <testcase classname="scripts.vrouter.test_dpdk_vifdump.TestVifdump" name="test_vifdump_on_interface[dev_reg,sanity]" time="2.698">
      <skipped>Skipped as test is not supported if dpdk_cluster=False </skipped>

    </testcase>

    <testcase classname="scripts.vrouter.test_fat_flow_aggr.FatFlowAggr" name="test_fat_flow_aggr_dest_icmp_intra_vn_inter_node[dev_reg,sanity]" time="323.783">
      <failure type="testtools.testresult.real._StringException">Traceback (most recent call last):
testtools.testresult.real._StringException: Traceback (most recent call last):
  File &quot;/contrail-test/tcutils/wrappers.py&quot;, line 176, in wrapper
    raise TestFailed(&quot;\n &quot;.join(errmsg))
tcutils.cores.TestFailed: Test failed: AssertionError
Python 3.9.25: /usr/bin/python3
Mon Oct  5 04:46:00 2026

A problem occurred in a Python script.  Here is the sequence of
function calls leading up to the error, in the order they occurred.

 /contrail-test/tcutils/wrappers.py in wrapper(self=&lt;scripts.vrouter.test_fat_flow_aggr.FatFlowAggr...._vn_inter_node[dev_reg,sanity] id=0x7efe214245b0&gt;, *args=(), **kwargs={})
   78             log.info(&apos;Initial checks done. Running the testcase now&apos;)
   79             log.info(&apos;&apos;)
   80             result = function(self, *args, **kwargs)
   81             if self.inputs.upgrade:
   82                 pid = os.getpid()
result = None
function = &lt;function FatFlowAggr.test_fat_flow_aggr_dest_icmp_intra_vn_inter_node&gt;
self = &lt;scripts.vrouter.test_fat_flow_aggr.FatFlowAggr...._vn_inter_node[dev_reg,sanity] id=0x7efe214245b0&gt;
args = ()
kwargs = {}

 /contrail-test/scripts/vrouter/test_fat_flow_aggr.py in test_fat_flow_aggr_dest_icmp_intra_vn_inter_node(self=&lt;scripts.vrouter.test_fat_flow_aggr.FatFlowAggr...._vn_inter_node[dev_reg,sanity] id=0x7efe214245b0&gt;)
   56         policy_deny = False
   57         vn_policy = False
   58         self.fat_flow_with_prefix_aggr(prefix_length=prefix_length,
   59             inter_node=inter_node,inter_vn=inter_vn,
   60             proto=proto, port=port, policy_deny=policy_deny, vn_policy=vn_policy,
self = &lt;scripts.vrouter.test_fat_flow_aggr.FatFlowAggr...._vn_inter_node[dev_reg,sanity] id=0x7efe214245b0&gt;
self.fat_flow_with_prefix_aggr = &lt;bound method BaseVrouterTest.fat_flow_with_pref...vn_inter_node[dev_reg,sanity] id=0x7efe214245b0&gt;&gt;
prefix_length = 27
inter_node = True
inter_vn = False
proto = &apos;icmp&apos;
port = 0
policy_deny = False
vn_policy = False
dual undefined
ipv6 = False
prefix_length6 = 123
only_v6 = False

 /contrail-test/common/vrouter/base.py in fat_flow_with_prefix_aggr(self=&lt;scripts.vrouter.test_fat_flow_aggr.FatFlowAggr...._vn_inter_node[dev_reg,sanity] id=0x7efe214245b0&gt;, prefix_length=27, prefix_length6=123, inter_node=True, inter_vn=False, dual=False, traffic_recvr=False, unidirectional_traffic=True, ignore_address=None, proto=&apos;icmp&apos;, port=0, portv6=56, svc_chain=False, only_v6=False, af=&apos;v4&apos;, icmp_error=False, hc=None, vn_policy=False, policy_deny=False, svm_inter_node=False, resources=True, scale=False)
  422                                         node_name=server_compute)
  423             for server in self.server_fixtures:
  424                 assert server.wait_till_vm_is_up()
  425 
  426         server_fixtures = self.server_fixtures
server = &lt;VMFixture: ctest-FatFlowAggr-76866387-68435324&gt;
server.wait_till_vm_is_up = &lt;bound method VMFixture.wait_till_vm_is_up of &lt;VMFixture: ctest-FatFlowAggr-76866387-68435324&gt;&gt;
AssertionError: 
    __cause__ = None
    __class__ = &lt;class &apos;AssertionError&apos;&gt;
    __context__ = None
    __delattr__ = &lt;method-wrapper &apos;__delattr__&apos; of AssertionError object&gt;
    __dict__ = {}
    __dir__ = &lt;built-in method __dir__ of AssertionError object&gt;
    __doc__ = &apos;Assertion failed.&apos;
    __eq__ = &lt;method-wrapper &apos;__eq__&apos; of AssertionError object&gt;
    __format__ = &lt;built-in method __format__ of AssertionError object&gt;
    __ge__ = &lt;method-wrapper &apos;__ge__&apos; of AssertionError object&gt;
    __getattribute__ = &lt;method-wrapper &apos;__getattribute__&apos; of AssertionError object&gt;
    __gt__ = &lt;method-wrapper &apos;__gt__&apos; of AssertionError object&gt;
    __hash__ = &lt;method-wrapper &apos;__hash__&apos; of AssertionError object&gt;
    __init__ = &lt;method-wrapper &apos;__init__&apos; of AssertionError object&gt;
    __init_subclass__ = &lt;built-in method __init_subclass__ of type object&gt;
    __le__ = &lt;method-wrapper &apos;__le__&apos; of AssertionError object&gt;
    __lt__ = &lt;method-wrapper &apos;__lt__&apos; of AssertionError object&gt;
    __ne__ = &lt;method-wrapper &apos;__ne__&apos; of AssertionError object&gt;
    __new__ = &lt;built-in method __new__ of type object&gt;
    __reduce__ = &lt;built-in method __reduce__ of AssertionError object&gt;
    __reduce_ex__ = &lt;built-in method __reduce_ex__ of AssertionError object&gt;
    __repr__ = &lt;method-wrapper &apos;__repr__&apos; of AssertionError object&gt;
    __setattr__ = &lt;method-wrapper &apos;__setattr__&apos; of AssertionError object&gt;
    __setstate__ = &lt;built-in method __setstate__ of AssertionError object&gt;
    __sizeof__ = &lt;built-in method __sizeof__ of AssertionError object&gt;
    __str__ = &lt;method-wrapper &apos;__str__&apos; of AssertionError object&gt;
    __subclasshook__ = &lt;built-in method __subclasshook__ of type object&gt;
    __suppress_context__ = False
    __traceback__ = &lt;traceback object&gt;
    args = ()
    with_traceback = &lt;built-in method with_traceback of AssertionError object&gt;

The above is a description of an error in a Python program.  Here is
the original traceback:

Traceback (most recent call last):
  File &quot;/contrail-test/tcutils/wrappers.py&quot;, line 80, in wrapper
    result = function(self, *args, **kwargs)
  File &quot;/contrail-test/scripts/vrouter/test_fat_flow_aggr.py&quot;, line 58, in test_fat_flow_aggr_dest_icmp_intra_vn_inter_node
    self.fat_flow_with_prefix_aggr(prefix_length=prefix_length,
  File &quot;/contrail-test/common/vrouter/base.py&quot;, line 424, in fat_flow_with_prefix_aggr
    assert server.wait_till_vm_is_up()
AssertionError

</failure>

    </testcase>

    <testcase classname="scripts.vrouter.test_routes.TestRoutes" name="test_rt_table_scenario_1[dev_reg,sanity]" time="213.832" />

    <testcase classname="scripts.vrouter.test_subinterfaces.TestSubInterfaces" name="test_vlan_interface_2[cb_sanity,dev_reg,dev_sanity_dpdk,sanity]" time="262.265">
      <failure type="testtools.testresult.real._StringException">Traceback (most recent call last):
testtools.testresult.real._StringException: Traceback (most recent call last):
  File &quot;/contrail-test/tcutils/wrappers.py&quot;, line 176, in wrapper
    raise TestFailed(&quot;\n &quot;.join(errmsg))
tcutils.cores.TestFailed: Test failed: AssertionError
Python 3.9.25: /usr/bin/python3
Mon Oct  5 04:54:14 2026

A problem occurred in a Python script.  Here is the sequence of
function calls leading up to the error, in the order they occurred.

 /contrail-test/tcutils/wrappers.py in wrapper(self=&lt;scripts.vrouter.test_subinterfaces.TestSubInter...ev_reg,dev_sanity_dpdk,sanity] id=0x7efe213b6cd0&gt;, *args=(), **kwargs={})
   78             log.info(&apos;Initial checks done. Running the testcase now&apos;)
   79             log.info(&apos;&apos;)
   80             result = function(self, *args, **kwargs)
   81             if self.inputs.upgrade:
   82                 pid = os.getpid()
result = None
function = &lt;function TestSubInterfaces.test_vlan_interface_2&gt;
self = &lt;scripts.vrouter.test_subinterfaces.TestSubInter...ev_reg,dev_sanity_dpdk,sanity] id=0x7efe213b6cd0&gt;
args = ()
kwargs = {}

 /contrail-test/scripts/vrouter/test_subinterfaces.py in test_vlan_interface_2(self=&lt;scripts.vrouter.test_subinterfaces.TestSubInter...ev_reg,dev_sanity_dpdk,sanity] id=0x7efe213b6cd0&gt;)
  117 
  118         assert vm1_fixture.wait_till_vm_is_up()
  119         assert vm2_fixture.wait_till_vm_is_up()
  120         assert vm3_fixture.wait_till_vm_is_up()
  121 
vm2_fixture = &lt;VMFixture: ctest-TestSubInterfaces-34575999-59109820&gt;
vm2_fixture.wait_till_vm_is_up = &lt;bound method VMFixture.wait_till_vm_is_up of &lt;V...ture: ctest-TestSubInterfaces-34575999-59109820&gt;&gt;
AssertionError: 
    __cause__ = None
    __class__ = &lt;class &apos;AssertionError&apos;&gt;
    __context__ = None
    __delattr__ = &lt;method-wrapper &apos;__delattr__&apos; of AssertionError object&gt;
    __dict__ = {}
    __dir__ = &lt;built-in method __dir__ of AssertionError object&gt;
    __doc__ = &apos;Assertion failed.&apos;
    __eq__ = &lt;method-wrapper &apos;__eq__&apos; of AssertionError object&gt;
    __format__ = &lt;built-in method __format__ of AssertionError object&gt;
    __ge__ = &lt;method-wrapper &apos;__ge__&apos; of AssertionError object&gt;
    __getattribute__ = &lt;method-wrapper &apos;__getattribute__&apos; of AssertionError object&gt;
    __gt__ = &lt;method-wrapper &apos;__gt__&apos; of AssertionError object&gt;
    __hash__ = &lt;method-wrapper &apos;__hash__&apos; of AssertionError object&gt;
    __init__ = &lt;method-wrapper &apos;__init__&apos; of AssertionError object&gt;
    __init_subclass__ = &lt;built-in method __init_subclass__ of type object&gt;
    __le__ = &lt;method-wrapper &apos;__le__&apos; of AssertionError object&gt;
    __lt__ = &lt;method-wrapper &apos;__lt__&apos; of AssertionError object&gt;
    __ne__ = &lt;method-wrapper &apos;__ne__&apos; of AssertionError object&gt;
    __new__ = &lt;built-in method __new__ of type object&gt;
    __reduce__ = &lt;built-in method __reduce__ of AssertionError object&gt;
    __reduce_ex__ = &lt;built-in method __reduce_ex__ of AssertionError object&gt;
    __repr__ = &lt;method-wrapper &apos;__repr__&apos; of AssertionError object&gt;
    __setattr__ = &lt;method-wrapper &apos;__setattr__&apos; of AssertionError object&gt;
    __setstate__ = &lt;built-in method __setstate__ of AssertionError object&gt;
    __sizeof__ = &lt;built-in method __sizeof__ of AssertionError object&gt;
    __str__ = &lt;method-wrapper &apos;__str__&apos; of AssertionError object&gt;
    __subclasshook__ = &lt;built-in method __subclasshook__ of type object&gt;
    __suppress_context__ = False
    __traceback__ = &lt;traceback object&gt;
    args = ()
    with_traceback = &lt;built-in method with_traceback of AssertionError object&gt;

The above is a description of an error in a Python program.  Here is
the original traceback:

Traceback (most recent call last):
  File &quot;/contrail-test/tcutils/wrappers.py&quot;, line 80, in wrapper
    result = function(self, *args, **kwargs)
  File &quot;/contrail-test/scripts/vrouter/test_subinterfaces.py&quot;, line 119, in test_vlan_interface_2
    assert vm2_fixture.wait_till_vm_is_up()
AssertionError

</failure>

    </testcase>

    <testcase classname="scripts.vrouter.test_tcp_mtu_probe.TestMtuProbe" name="test_mtu_probe_intra_node[dev_reg,sanity]" time="155.612" />

    <testcase classname="scripts.vrouter.test_vif_stats.TestvifStats" name="test_vif_statistics[dev_reg,sanity]" time="130.662" />

  </testsuite>
  <testsuite errors="0" failures="10" id="1" name="" package="" skipped="7" tests="28" time="3702.601">
    <testcase classname="serial_scripts.analytics.test_analytics_resource.AnalyticsTestSanityWithMin" name="test_run_contrail_flows_cli_cmds[sanity]" time="17.228" />

    <testcase classname="serial_scripts.analytics.test_analytics_resource.AnalyticsTestSanityWithMin" name="test_run_contrail_logs_cli_cmd_with_multiple_different_optional_args[sanity]" time="23.208" />

    <testcase classname="serial_scripts.analytics.test_analytics_resource.AnalyticsTestSanityWithMin" name="test_run_contrail_stats_cli_cmds[sanity]" time="29.342" />

    <testcase classname="" name="setUpClass (serial_scripts.analytics.test_analytics_resource.AnalyticsTestSanityWithResource)" time="0.000">
      <failure type="testtools.testresult.real._StringException">Traceback (most recent call last):
testtools.testresult.real._StringException: Traceback (most recent call last):
  File &quot;/contrail-test/serial_scripts/analytics/test_analytics_resource.py&quot;, line 249, in setUpClass
    cls.res.setUp(cls.inputs, cls.connections)
  File &quot;/contrail-test/serial_scripts/analytics/base.py&quot;, line 773, in setUp
    super(AnalyticsTestSanityWithResourceResource , self).setUp(inputs,connections)
  File &quot;/contrail-test/serial_scripts/analytics/base.py&quot;, line 594, in setUp
    self.setup_common_objects(self.inputs , self.connections)
  File &quot;/contrail-test/serial_scripts/analytics/base.py&quot;, line 636, in setup_common_objects
    self.verify_common_objects()
  File &quot;/contrail-test/serial_scripts/analytics/base.py&quot;, line 643, in verify_common_objects
    assert self.fvn_vm1_fixture.wait_till_vm_is_up()
AssertionError

</failure>

    </testcase>

    <testcase classname="serial_scripts.asn4.test_asn4.TestAsn4" name="test_basic_as4_ibgp_sanity[sanity]" time="2.648">
      <skipped>Skipping Test. At least 1 external router required to run the test</skipped>

    </testcase>

    <testcase classname="serial_scripts.bgpaas.test_bgpaas_local_as.TestBGPaaSlocalAS" name="test_basic_bgpaas_local_as[dev_sanity_dpdk,sanity]" time="210.993">
      <failure type="testtools.testresult.real._StringException">Traceback (most recent call last):
testtools.testresult.real._StringException: stdout: {{{
[localhost] local: mkdir -p /contrail-test/images
[localhost] local: wget -nv http://nexus.opensdn.io/repository///images/converts//ubuntu-bird.vmdk.gz -O /contrail-test/images/ubuntu-bird.vmdk.gz
[localhost] local: gunzip -f /contrail-test/images/ubuntu-bird.vmdk.gz
[localhost] local: rm -f /contrail-test/images/ubuntu-bird.vmdk
}}}

Traceback (most recent call last):
  File &quot;/contrail-test/tcutils/wrappers.py&quot;, line 176, in wrapper
    raise TestFailed(&quot;\n &quot;.join(errmsg))
tcutils.cores.TestFailed: Test failed: AssertionError
Python 3.9.25: /usr/bin/python3
Mon Oct  5 05:09:35 2026

A problem occurred in a Python script.  Here is the sequence of
function calls leading up to the error, in the order they occurred.

 /contrail-test/tcutils/wrappers.py in wrapper(self=&lt;serial_scripts.bgpaas.test_bgpaas_local_as.Test...cal_as[dev_sanity_dpdk,sanity] id=0x7f8f35f087c0&gt;, *args=(), **kwargs={})
   78             log.info(&apos;Initial checks done. Running the testcase now&apos;)
   79             log.info(&apos;&apos;)
   80             result = function(self, *args, **kwargs)
   81             if self.inputs.upgrade:
   82                 pid = os.getpid()
result = None
function = &lt;function TestBGPaaSlocalAS.test_basic_bgpaas_local_as&gt;
self = &lt;serial_scripts.bgpaas.test_bgpaas_local_as.Test...cal_as[dev_sanity_dpdk,sanity] id=0x7f8f35f087c0&gt;
args = ()
kwargs = {}

 /contrail-test/serial_scripts/bgpaas/test_bgpaas_local_as.py in test_basic_bgpaas_local_as(self=&lt;serial_scripts.bgpaas.test_bgpaas_local_as.Test...cal_as[dev_sanity_dpdk,sanity] id=0x7f8f35f087c0&gt;)
   31         2. Make sure BGP with vm comes up.
   32         &apos;&apos;&apos;
   33         ret_dict = self.config_basic(image_name=&apos;ubuntu-bird&apos;)
   34         vn_fixture = ret_dict[&apos;vn_fixture&apos;]
   35         test_vm = ret_dict[&apos;test_vm&apos;]
ret_dict undefined
self = &lt;serial_scripts.bgpaas.test_bgpaas_local_as.Test...cal_as[dev_sanity_dpdk,sanity] id=0x7f8f35f087c0&gt;
self.config_basic = &lt;bound method LocalASBase.config_basic of &lt;seria...al_as[dev_sanity_dpdk,sanity] id=0x7f8f35f087c0&gt;&gt;
image_name undefined

 /contrail-test/serial_scripts/bgpaas/base.py in config_basic(self=&lt;serial_scripts.bgpaas.test_bgpaas_local_as.Test...cal_as[dev_sanity_dpdk,sanity] id=0x7f8f35f087c0&gt;, image_name=&apos;ubuntu-bird&apos;)
   47 
   48         assert test_vm.wait_till_vm_is_up()
   49         assert bgpaas_vm1.wait_till_vm_is_up()
   50         ret_dict = {
   51             &apos;vn_fixture&apos;: vn_fixture,
bgpaas_vm1 = &lt;VMFixture: bgpaas_vm1&gt;
bgpaas_vm1.wait_till_vm_is_up = &lt;bound method VMFixture.wait_till_vm_is_up of &lt;VMFixture: bgpaas_vm1&gt;&gt;
AssertionError: 
    __cause__ = None
    __class__ = &lt;class &apos;AssertionError&apos;&gt;
    __context__ = None
    __delattr__ = &lt;method-wrapper &apos;__delattr__&apos; of AssertionError object&gt;
    __dict__ = {}
    __dir__ = &lt;built-in method __dir__ of AssertionError object&gt;
    __doc__ = &apos;Assertion failed.&apos;
    __eq__ = &lt;method-wrapper &apos;__eq__&apos; of AssertionError object&gt;
    __format__ = &lt;built-in method __format__ of AssertionError object&gt;
    __ge__ = &lt;method-wrapper &apos;__ge__&apos; of AssertionError object&gt;
    __getattribute__ = &lt;method-wrapper &apos;__getattribute__&apos; of AssertionError object&gt;
    __gt__ = &lt;method-wrapper &apos;__gt__&apos; of AssertionError object&gt;
    __hash__ = &lt;method-wrapper &apos;__hash__&apos; of AssertionError object&gt;
    __init__ = &lt;method-wrapper &apos;__init__&apos; of AssertionError object&gt;
    __init_subclass__ = &lt;built-in method __init_subclass__ of type object&gt;
    __le__ = &lt;method-wrapper &apos;__le__&apos; of AssertionError object&gt;
    __lt__ = &lt;method-wrapper &apos;__lt__&apos; of AssertionError object&gt;
    __ne__ = &lt;method-wrapper &apos;__ne__&apos; of AssertionError object&gt;
    __new__ = &lt;built-in method __new__ of type object&gt;
    __reduce__ = &lt;built-in method __reduce__ of AssertionError object&gt;
    __reduce_ex__ = &lt;built-in method __reduce_ex__ of AssertionError object&gt;
    __repr__ = &lt;method-wrapper &apos;__repr__&apos; of AssertionError object&gt;
    __setattr__ = &lt;method-wrapper &apos;__setattr__&apos; of AssertionError object&gt;
    __setstate__ = &lt;built-in method __setstate__ of AssertionError object&gt;
    __sizeof__ = &lt;built-in method __sizeof__ of AssertionError object&gt;
    __str__ = &lt;method-wrapper &apos;__str__&apos; of AssertionError object&gt;
    __subclasshook__ = &lt;built-in method __subclasshook__ of type object&gt;
    __suppress_context__ = False
    __traceback__ = &lt;traceback object&gt;
    args = ()
    with_traceback = &lt;built-in method with_traceback of AssertionError object&gt;

The above is a description of an error in a Python program.  Here is
the original traceback:

Traceback (most recent call last):
  File &quot;/contrail-test/tcutils/wrappers.py&quot;, line 80, in wrapper
    result = function(self, *args, **kwargs)
  File &quot;/contrail-test/serial_scripts/bgpaas/test_bgpaas_local_as.py&quot;, line 33, in test_basic_bgpaas_local_as
    ret_dict = self.config_basic(image_name=&apos;ubuntu-bird&apos;)
  File &quot;/contrail-test/serial_scripts/bgpaas/base.py&quot;, line 49, in config_basic
    assert bgpaas_vm1.wait_till_vm_is_up()
AssertionError

</failure>

    </testcase>

    <testcase classname="serial_scripts.bgpaas.test_bgpaas_zone.TestBGPaasZone" name="test_bgp_control_node_zone[sanity]" time="380.680">
      <failure type="testtools.testresult.real._StringException">Traceback (most recent call last):
testtools.testresult.real._StringException: Traceback (most recent call last):
  File &quot;/contrail-test/tcutils/wrappers.py&quot;, line 176, in wrapper
    raise TestFailed(&quot;\n &quot;.join(errmsg))
tcutils.cores.TestFailed: Test failed: AssertionError
Python 3.9.25: /usr/bin/python3
Mon Oct  5 05:16:00 2026

A problem occurred in a Python script.  Here is the sequence of
function calls leading up to the error, in the order they occurred.

 /contrail-test/tcutils/wrappers.py in wrapper(self=&lt;serial_scripts.bgpaas.test_bgpaas_zone.TestBGPa..._bgp_control_node_zone[sanity] id=0x7f8f35f128b0&gt;, *args=(), **kwargs={})
   78             log.info(&apos;Initial checks done. Running the testcase now&apos;)
   79             log.info(&apos;&apos;)
   80             result = function(self, *args, **kwargs)
   81             if self.inputs.upgrade:
   82                 pid = os.getpid()
result = None
function = &lt;function TestBGPaasZone.test_bgp_control_node_zone&gt;
self = &lt;serial_scripts.bgpaas.test_bgpaas_zone.TestBGPa..._bgp_control_node_zone[sanity] id=0x7f8f35f128b0&gt;
args = ()
kwargs = {}

 /contrail-test/serial_scripts/bgpaas/test_bgpaas_zone.py in test_bgp_control_node_zone(self=&lt;serial_scripts.bgpaas.test_bgpaas_zone.TestBGPa..._bgp_control_node_zone[sanity] id=0x7f8f35f128b0&gt;)
   57         cnt = 0
   58         self.logger.info(&apos;executing bgp_control_zone test&apos;)
   59         assert self.basic_control_node_zone_setup()
   60         # update control node zone with different bgp routers
   61         self.update_control_node_zones(self.cnzs)
self = &lt;serial_scripts.bgpaas.test_bgpaas_zone.TestBGPa..._bgp_control_node_zone[sanity] id=0x7f8f35f128b0&gt;
self.basic_control_node_zone_setup = &lt;bound method TestBGPaasZone.basic_control_node_...bgp_control_node_zone[sanity] id=0x7f8f35f128b0&gt;&gt;

 /contrail-test/serial_scripts/bgpaas/test_bgpaas_zone.py in basic_control_node_zone_setup(self=&lt;serial_scripts.bgpaas.test_bgpaas_zone.TestBGPa..._bgp_control_node_zone[sanity] id=0x7f8f35f128b0&gt;, ctrl_zone=None)
   31             self.vms.append(self.create_vm(vn_fixture=self.vn, image_name=&apos;ubuntu-bird&apos;))
   32         self.client_vm = self.create_vm(vn_fixture=self.vn, image_name=&apos;ubuntu-bird&apos;)
   33         self.check_vms_booted(self.vms + [self.client_vm])
   34         for bgp_name in self.inputs.bgp_names:
   35             self.cnzs  +=  self.create_control_node_zones(&quot;test-zone&quot;,[bgp_name])
self = &lt;serial_scripts.bgpaas.test_bgpaas_zone.TestBGPa..._bgp_control_node_zone[sanity] id=0x7f8f35f128b0&gt;
self.check_vms_booted = &lt;bound method GenericTestBase.check_vms_booted o...scripts.bgpaas.test_bgpaas_zone.TestBGPaasZone&apos;&gt;&gt;
self.vms = [&lt;VMFixture: ctest-TestBGPaasZone-38142884-61930969&gt;, &lt;VMFixture: ctest-TestBGPaasZone-38142884-92059372&gt;]
self.client_vm = &lt;VMFixture: ctest-TestBGPaasZone-38142884-34517296&gt;

 /contrail-test/common/base.py in check_vms_booted(cls=&lt;class &apos;serial_scripts.bgpaas.test_bgpaas_zone.TestBGPaasZone&apos;&gt;, vms_list=[&lt;VMFixture: ctest-TestBGPaasZone-38142884-61930969&gt;, &lt;VMFixture: ctest-TestBGPaasZone-38142884-92059372&gt;, &lt;VMFixture: ctest-TestBGPaasZone-38142884-34517296&gt;], do_assert=True)
  720             for vm_fixture in vms_list:
  721                 vm_fixture.cleanUp()
  722             assert False, &apos;One or more vm-boots failed. Check logs&apos;
  723         if failed:
  724             return False

AssertionError: One or more vm-boots failed. Check logs
    __cause__ = None
    __class__ = &lt;class &apos;AssertionError&apos;&gt;
    __context__ = None
    __delattr__ = &lt;method-wrapper &apos;__delattr__&apos; of AssertionError object&gt;
    __dict__ = {}
    __dir__ = &lt;built-in method __dir__ of AssertionError object&gt;
    __doc__ = &apos;Assertion failed.&apos;
    __eq__ = &lt;method-wrapper &apos;__eq__&apos; of AssertionError object&gt;
    __format__ = &lt;built-in method __format__ of AssertionError object&gt;
    __ge__ = &lt;method-wrapper &apos;__ge__&apos; of AssertionError object&gt;
    __getattribute__ = &lt;method-wrapper &apos;__getattribute__&apos; of AssertionError object&gt;
    __gt__ = &lt;method-wrapper &apos;__gt__&apos; of AssertionError object&gt;
    __hash__ = &lt;method-wrapper &apos;__hash__&apos; of AssertionError object&gt;
    __init__ = &lt;method-wrapper &apos;__init__&apos; of AssertionError object&gt;
    __init_subclass__ = &lt;built-in method __init_subclass__ of type object&gt;
    __le__ = &lt;method-wrapper &apos;__le__&apos; of AssertionError object&gt;
    __lt__ = &lt;method-wrapper &apos;__lt__&apos; of AssertionError object&gt;
    __ne__ = &lt;method-wrapper &apos;__ne__&apos; of AssertionError object&gt;
    __new__ = &lt;built-in method __new__ of type object&gt;
    __reduce__ = &lt;built-in method __reduce__ of AssertionError object&gt;
    __reduce_ex__ = &lt;built-in method __reduce_ex__ of AssertionError object&gt;
    __repr__ = &lt;method-wrapper &apos;__repr__&apos; of AssertionError object&gt;
    __setattr__ = &lt;method-wrapper &apos;__setattr__&apos; of AssertionError object&gt;
    __setstate__ = &lt;built-in method __setstate__ of AssertionError object&gt;
    __sizeof__ = &lt;built-in method __sizeof__ of AssertionError object&gt;
    __str__ = &lt;method-wrapper &apos;__str__&apos; of AssertionError object&gt;
    __subclasshook__ = &lt;built-in method __subclasshook__ of type object&gt;
    __suppress_context__ = False
    __traceback__ = &lt;traceback object&gt;
    args = (&apos;One or more vm-boots failed. Check logs&apos;,)
    with_traceback = &lt;built-in method with_traceback of AssertionError object&gt;

The above is a description of an error in a Python program.  Here is
the original traceback:

Traceback (most recent call last):
  File &quot;/contrail-test/tcutils/wrappers.py&quot;, line 80, in wrapper
    result = function(self, *args, **kwargs)
  File &quot;/contrail-test/serial_scripts/bgpaas/test_bgpaas_zone.py&quot;, line 59, in test_bgp_control_node_zone
    assert self.basic_control_node_zone_setup()
  File &quot;/contrail-test/serial_scripts/bgpaas/test_bgpaas_zone.py&quot;, line 33, in basic_control_node_zone_setup
    self.check_vms_booted(self.vms + [self.client_vm])
  File &quot;/contrail-test/common/base.py&quot;, line 722, in check_vms_booted
    assert False, &apos;One or more vm-boots failed. Check logs&apos;
AssertionError: One or more vm-boots failed. Check logs

</failure>

    </testcase>

    <testcase classname="serial_scripts.bgpaas.test_bgpaas_zone.TestBGPaasZone" name="test_bgp_control_node_zones_from_single_vnf[sanity]" time="161.505">
      <failure type="testtools.testresult.real._StringException">Traceback (most recent call last):
testtools.testresult.real._StringException: Traceback (most recent call last):
  File &quot;/contrail-test/tcutils/wrappers.py&quot;, line 176, in wrapper
    raise TestFailed(&quot;\n &quot;.join(errmsg))
tcutils.cores.TestFailed: Test failed: AssertionError
Python 3.9.25: /usr/bin/python3
Mon Oct  5 05:18:44 2026

A problem occurred in a Python script.  Here is the sequence of
function calls leading up to the error, in the order they occurred.

 /contrail-test/tcutils/wrappers.py in wrapper(self=&lt;serial_scripts.bgpaas.test_bgpaas_zone.TestBGPa..._zones_from_single_vnf[sanity] id=0x7f8f35f12af0&gt;, *args=(), **kwargs={})
   78             log.info(&apos;Initial checks done. Running the testcase now&apos;)
   79             log.info(&apos;&apos;)
   80             result = function(self, *args, **kwargs)
   81             if self.inputs.upgrade:
   82                 pid = os.getpid()
result = None
function = &lt;function TestBGPaasZone.test_bgp_control_node_zones_from_single_vnf&gt;
self = &lt;serial_scripts.bgpaas.test_bgpaas_zone.TestBGPa..._zones_from_single_vnf[sanity] id=0x7f8f35f12af0&gt;
args = ()
kwargs = {}

 /contrail-test/serial_scripts/bgpaas/test_bgpaas_zone.py in test_bgp_control_node_zones_from_single_vnf(self=&lt;serial_scripts.bgpaas.test_bgpaas_zone.TestBGPa..._zones_from_single_vnf[sanity] id=0x7f8f35f12af0&gt;)
  145         self.logger.info(&apos;executing bgp_control_zone agent restart test&apos;)
  146         host_ips = []
  147         assert self.basic_control_node_zone_setup(&apos;both-zones&apos;)
  148         for vm in self.vms:
  149             assert self.verify_bgpaas_in_control_nodes_and_agent(self.bgpaas_fixtures[cnt],vm)
self = &lt;serial_scripts.bgpaas.test_bgpaas_zone.TestBGPa..._zones_from_single_vnf[sanity] id=0x7f8f35f12af0&gt;
self.basic_control_node_zone_setup = &lt;bound method TestBGPaasZone.basic_control_node_...zones_from_single_vnf[sanity] id=0x7f8f35f12af0&gt;&gt;

 /contrail-test/serial_scripts/bgpaas/test_bgpaas_zone.py in basic_control_node_zone_setup(self=&lt;serial_scripts.bgpaas.test_bgpaas_zone.TestBGPa..._zones_from_single_vnf[sanity] id=0x7f8f35f12af0&gt;, ctrl_zone=&apos;both-zones&apos;)
   31             self.vms.append(self.create_vm(vn_fixture=self.vn, image_name=&apos;ubuntu-bird&apos;))
   32         self.client_vm = self.create_vm(vn_fixture=self.vn, image_name=&apos;ubuntu-bird&apos;)
   33         self.check_vms_booted(self.vms + [self.client_vm])
   34         for bgp_name in self.inputs.bgp_names:
   35             self.cnzs  +=  self.create_control_node_zones(&quot;test-zone&quot;,[bgp_name])
self = &lt;serial_scripts.bgpaas.test_bgpaas_zone.TestBGPa..._zones_from_single_vnf[sanity] id=0x7f8f35f12af0&gt;
self.check_vms_booted = &lt;bound method GenericTestBase.check_vms_booted o...scripts.bgpaas.test_bgpaas_zone.TestBGPaasZone&apos;&gt;&gt;
self.vms = [&lt;VMFixture: ctest-TestBGPaasZone-38142884-86148002&gt;, &lt;VMFixture: ctest-TestBGPaasZone-38142884-08810107&gt;]
self.client_vm = &lt;VMFixture: ctest-TestBGPaasZone-38142884-30093862&gt;

 /contrail-test/common/base.py in check_vms_booted(cls=&lt;class &apos;serial_scripts.bgpaas.test_bgpaas_zone.TestBGPaasZone&apos;&gt;, vms_list=[&lt;VMFixture: ctest-TestBGPaasZone-38142884-86148002&gt;, &lt;VMFixture: ctest-TestBGPaasZone-38142884-08810107&gt;, &lt;VMFixture: ctest-TestBGPaasZone-38142884-30093862&gt;], do_assert=True)
  720             for vm_fixture in vms_list:
  721                 vm_fixture.cleanUp()
  722             assert False, &apos;One or more vm-boots failed. Check logs&apos;
  723         if failed:
  724             return False

AssertionError: One or more vm-boots failed. Check logs
    __cause__ = None
    __class__ = &lt;class &apos;AssertionError&apos;&gt;
    __context__ = None
    __delattr__ = &lt;method-wrapper &apos;__delattr__&apos; of AssertionError object&gt;
    __dict__ = {}
    __dir__ = &lt;built-in method __dir__ of AssertionError object&gt;
    __doc__ = &apos;Assertion failed.&apos;
    __eq__ = &lt;method-wrapper &apos;__eq__&apos; of AssertionError object&gt;
    __format__ = &lt;built-in method __format__ of AssertionError object&gt;
    __ge__ = &lt;method-wrapper &apos;__ge__&apos; of AssertionError object&gt;
    __getattribute__ = &lt;method-wrapper &apos;__getattribute__&apos; of AssertionError object&gt;
    __gt__ = &lt;method-wrapper &apos;__gt__&apos; of AssertionError object&gt;
    __hash__ = &lt;method-wrapper &apos;__hash__&apos; of AssertionError object&gt;
    __init__ = &lt;method-wrapper &apos;__init__&apos; of AssertionError object&gt;
    __init_subclass__ = &lt;built-in method __init_subclass__ of type object&gt;
    __le__ = &lt;method-wrapper &apos;__le__&apos; of AssertionError object&gt;
    __lt__ = &lt;method-wrapper &apos;__lt__&apos; of AssertionError object&gt;
    __ne__ = &lt;method-wrapper &apos;__ne__&apos; of AssertionError object&gt;
    __new__ = &lt;built-in method __new__ of type object&gt;
    __reduce__ = &lt;built-in method __reduce__ of AssertionError object&gt;
    __reduce_ex__ = &lt;built-in method __reduce_ex__ of AssertionError object&gt;
    __repr__ = &lt;method-wrapper &apos;__repr__&apos; of AssertionError object&gt;
    __setattr__ = &lt;method-wrapper &apos;__setattr__&apos; of AssertionError object&gt;
    __setstate__ = &lt;built-in method __setstate__ of AssertionError object&gt;
    __sizeof__ = &lt;built-in method __sizeof__ of AssertionError object&gt;
    __str__ = &lt;method-wrapper &apos;__str__&apos; of AssertionError object&gt;
    __subclasshook__ = &lt;built-in method __subclasshook__ of type object&gt;
    __suppress_context__ = False
    __traceback__ = &lt;traceback object&gt;
    args = (&apos;One or more vm-boots failed. Check logs&apos;,)
    with_traceback = &lt;built-in method with_traceback of AssertionError object&gt;

The above is a description of an error in a Python program.  Here is
the original traceback:

Traceback (most recent call last):
  File &quot;/contrail-test/tcutils/wrappers.py&quot;, line 80, in wrapper
    result = function(self, *args, **kwargs)
  File &quot;/contrail-test/serial_scripts/bgpaas/test_bgpaas_zone.py&quot;, line 147, in test_bgp_control_node_zones_from_single_vnf
    assert self.basic_control_node_zone_setup(&apos;both-zones&apos;)
  File &quot;/contrail-test/serial_scripts/bgpaas/test_bgpaas_zone.py&quot;, line 33, in basic_control_node_zone_setup
    self.check_vms_booted(self.vms + [self.client_vm])
  File &quot;/contrail-test/common/base.py&quot;, line 722, in check_vms_booted
    assert False, &apos;One or more vm-boots failed. Check logs&apos;
AssertionError: One or more vm-boots failed. Check logs

</failure>

    </testcase>

    <testcase classname="serial_scripts.device_manager.test_dm.TestDM" name="test_basic_dm[sanity]" time="2.652">
      <skipped>dm_mx env needs to be set in testbed.py to run this script</skipped>

    </testcase>

    <testcase classname="serial_scripts.encap.test_encap.TestEncapCases" name="test_apply_policy_fip_on_same_vn_gw_mx[sanity,serial]" time="2.639">
      <skipped>Skipping Test. Env variable MX_TEST is not set. Skipping the test</skipped>

    </testcase>

    <testcase classname="serial_scripts.evpn.test_evpn.TestEvpnCasesRestart" name="test_with_vxlan_encap_agent_restart[sanity,serial]" time="249.991">
      <failure type="testtools.testresult.real._StringException">Traceback (most recent call last):
testtools.testresult.real._StringException: Traceback (most recent call last):
  File &quot;/contrail-test/tcutils/wrappers.py&quot;, line 176, in wrapper
    raise TestFailed(&quot;\n &quot;.join(errmsg))
tcutils.cores.TestFailed: Test failed: AssertionError
Python 3.9.25: /usr/bin/python3
Mon Oct  5 05:22:44 2026

A problem occurred in a Python script.  Here is the sequence of
function calls leading up to the error, in the order they occurred.

 /contrail-test/tcutils/wrappers.py in wrapper(self=&lt;serial_scripts.evpn.test_evpn.TestEvpnCasesRest...p_agent_restart[sanity,serial] id=0x7f8f35dac100&gt;, *args=(), **kwargs={})
   78             log.info(&apos;Initial checks done. Running the testcase now&apos;)
   79             log.info(&apos;&apos;)
   80             result = function(self, *args, **kwargs)
   81             if self.inputs.upgrade:
   82                 pid = os.getpid()
result = None
function = &lt;function TestEvpnCasesRestart.test_with_vxlan_encap_agent_restart&gt;
self = &lt;serial_scripts.evpn.test_evpn.TestEvpnCasesRest...p_agent_restart[sanity,serial] id=0x7f8f35dac100&gt;
args = ()
kwargs = {}

 /contrail-test/serial_scripts/evpn/test_evpn.py in test_with_vxlan_encap_agent_restart(self=&lt;serial_scripts.evpn.test_evpn.TestEvpnCasesRest...p_agent_restart[sanity,serial] id=0x7f8f35dac100&gt;)
  353          Maintainer: chhandak@juniper.net
  354         &apos;&apos;&apos;
  355         verdict=self.verify_epvn_with_agent_restart(encap=&apos;vxlan&apos;)
  356         if not verdict:
  357             print(&quot;collect logs for bug 1737030&quot;)
verdict undefined
self = &lt;serial_scripts.evpn.test_evpn.TestEvpnCasesRest...p_agent_restart[sanity,serial] id=0x7f8f35dac100&gt;
self.verify_epvn_with_agent_restart = &lt;bound method VerifyEvpnCases.verify_epvn_with_a..._agent_restart[sanity,serial] id=0x7f8f35dac100&gt;&gt;
encap undefined

 /contrail-test/serial_scripts/evpn/verify.py in verify_epvn_with_agent_restart(self=&lt;serial_scripts.evpn.test_evpn.TestEvpnCasesRest...p_agent_restart[sanity,serial] id=0x7f8f35dac100&gt;, encap=&apos;vxlan&apos;)
 1998         assert vn1_fixture.verify_on_setup()
 1999         assert vn1_vm1_fixture.verify_on_setup()
 2000         assert vn1_vm2_fixture.verify_on_setup()
 2001         assert vn1_vm1_fixture.wait_till_vm_is_up()
 2002         assert vn1_vm2_fixture.wait_till_vm_is_up()
vn1_vm2_fixture = &lt;VMFixture: EVPN_VN1_VM2&gt;
vn1_vm2_fixture.verify_on_setup = &lt;bound method VMFixture.verify_on_setup of &lt;VMFixture: EVPN_VN1_VM2&gt;&gt;
AssertionError: 
    __cause__ = None
    __class__ = &lt;class &apos;AssertionError&apos;&gt;
    __context__ = None
    __delattr__ = &lt;method-wrapper &apos;__delattr__&apos; of AssertionError object&gt;
    __dict__ = {}
    __dir__ = &lt;built-in method __dir__ of AssertionError object&gt;
    __doc__ = &apos;Assertion failed.&apos;
    __eq__ = &lt;method-wrapper &apos;__eq__&apos; of AssertionError object&gt;
    __format__ = &lt;built-in method __format__ of AssertionError object&gt;
    __ge__ = &lt;method-wrapper &apos;__ge__&apos; of AssertionError object&gt;
    __getattribute__ = &lt;method-wrapper &apos;__getattribute__&apos; of AssertionError object&gt;
    __gt__ = &lt;method-wrapper &apos;__gt__&apos; of AssertionError object&gt;
    __hash__ = &lt;method-wrapper &apos;__hash__&apos; of AssertionError object&gt;
    __init__ = &lt;method-wrapper &apos;__init__&apos; of AssertionError object&gt;
    __init_subclass__ = &lt;built-in method __init_subclass__ of type object&gt;
    __le__ = &lt;method-wrapper &apos;__le__&apos; of AssertionError object&gt;
    __lt__ = &lt;method-wrapper &apos;__lt__&apos; of AssertionError object&gt;
    __ne__ = &lt;method-wrapper &apos;__ne__&apos; of AssertionError object&gt;
    __new__ = &lt;built-in method __new__ of type object&gt;
    __reduce__ = &lt;built-in method __reduce__ of AssertionError object&gt;
    __reduce_ex__ = &lt;built-in method __reduce_ex__ of AssertionError object&gt;
    __repr__ = &lt;method-wrapper &apos;__repr__&apos; of AssertionError object&gt;
    __setattr__ = &lt;method-wrapper &apos;__setattr__&apos; of AssertionError object&gt;
    __setstate__ = &lt;built-in method __setstate__ of AssertionError object&gt;
    __sizeof__ = &lt;built-in method __sizeof__ of AssertionError object&gt;
    __str__ = &lt;method-wrapper &apos;__str__&apos; of AssertionError object&gt;
    __subclasshook__ = &lt;built-in method __subclasshook__ of type object&gt;
    __suppress_context__ = False
    __traceback__ = &lt;traceback object&gt;
    args = ()
    with_traceback = &lt;built-in method with_traceback of AssertionError object&gt;

The above is a description of an error in a Python program.  Here is
the original traceback:

Traceback (most recent call last):
  File &quot;/contrail-test/tcutils/wrappers.py&quot;, line 80, in wrapper
    result = function(self, *args, **kwargs)
  File &quot;/contrail-test/serial_scripts/evpn/test_evpn.py&quot;, line 355, in test_with_vxlan_encap_agent_restart
    verdict=self.verify_epvn_with_agent_restart(encap=&apos;vxlan&apos;)
  File &quot;/contrail-test/serial_scripts/evpn/verify.py&quot;, line 2000, in verify_epvn_with_agent_restart
    assert vn1_vm2_fixture.verify_on_setup()
AssertionError

</failure>

    </testcase>

    <testcase classname="serial_scripts.floatingip.test_mx.TestSerialSanity_MX" name="test_change_of_rt_in_vn[mx_test,sanity,serial]" time="2.669">
      <skipped>Skipping Test. Env variable MX_GW_TEST is not set</skipped>

    </testcase>

    <testcase classname="serial_scripts.gw_less_fwd.test_gw_less_fwd.TestGWLessFWD" name="test_gw_less_fwd_single_vn_ip_fab[cb_sanity,sanity]" time="2.654">
      <skipped>Skipping Test. Fabric gateway is required to run the test</skipped>

    </testcase>

    <testcase classname="serial_scripts.md5.test_md5.TestMd5testsOnControl" name="test_check_per_peer_on_control[sanity]" time="233.944" />

    <testcase classname="serial_scripts.md5.test_md5.TestMd5testsOnControl" name="test_create_md5_on_control[sanity]" time="234.918" />

    <testcase classname="serial_scripts.rbac.test_rbac.TestRbac" name="test_perms2_global_share[ci_sanity,sanity]" time="76.295" />

    <testcase classname="serial_scripts.rbac.test_rbac_basic.TestRbacBasic" name="test_perms2_owner[ci_sanity,sanity,suite1]" time="20.522" />

    <testcase classname="serial_scripts.rbac.test_rbac_basic.TestRbacBasic" name="test_rbac_acl_different_roles[ci_sanity,sanity,suite1]" time="21.757" />

    <testcase classname="serial_scripts.rbac.test_rbac_basic.TestRbacBasic" name="test_rbac_create_delete_vm[sanity,suite1]" time="70.232" />

    <testcase classname="scripts.analytics.test_analytics.AnalyticsTestSanity" name="test_contrail_status[cb_sanity,ci_sanity,dev_sanity_dpdk,sanity]" time="3.686" />

    <testcase classname="serial_scripts.vm_regression.test_vm_serial.TestBasicVMVN0" name="test_control_node_switchover[cb_sanity,sanity]" time="242.165">
      <failure type="testtools.testresult.real._StringException">Traceback (most recent call last):
testtools.testresult.real._StringException: Traceback (most recent call last):
  File &quot;/contrail-test/tcutils/wrappers.py&quot;, line 176, in wrapper
    raise TestFailed(&quot;\n &quot;.join(errmsg))
tcutils.cores.TestFailed: Test failed: AssertionError
Python 3.9.25: /usr/bin/python3
Mon Oct  5 05:38:51 2026

A problem occurred in a Python script.  Here is the sequence of
function calls leading up to the error, in the order they occurred.

 /contrail-test/tcutils/wrappers.py in wrapper(self=&lt;serial_scripts.vm_regression.test_vm_serial.Tes...e_switchover[cb_sanity,sanity] id=0x7f8f35602d60&gt;, *args=(), **kwargs={})
   78             log.info(&apos;Initial checks done. Running the testcase now&apos;)
   79             log.info(&apos;&apos;)
   80             result = function(self, *args, **kwargs)
   81             if self.inputs.upgrade:
   82                 pid = os.getpid()
result = None
function = &lt;function TestBasicVMVN0.test_control_node_switchover&gt;
self = &lt;serial_scripts.vm_regression.test_vm_serial.Tes...e_switchover[cb_sanity,sanity] id=0x7f8f35602d60&gt;
args = ()
kwargs = {}

 /contrail-test/serial_scripts/vm_regression/test_vm_serial.py in test_control_node_switchover(self=&lt;serial_scripts.vm_regression.test_vm_serial.Tes...e_switchover[cb_sanity,sanity] id=0x7f8f35602d60&gt;)
  636         vm2_fixture = self.create_vm(vn1_fixture, vn1_vm2_name)
  637         assert vm1_fixture.wait_till_vm_is_up()
  638         assert vm2_fixture.wait_till_vm_is_up()
  639         assert vm1_fixture.ping_to_ip(vm2_fixture.vm_ip)
  640         assert vm2_fixture.ping_to_ip(vm1_fixture.vm_ip)
vm2_fixture = &lt;VMFixture: ctest-vn1_vm2-76720314&gt;
vm2_fixture.wait_till_vm_is_up = &lt;bound method VMFixture.wait_till_vm_is_up of &lt;VMFixture: ctest-vn1_vm2-76720314&gt;&gt;
AssertionError: 
    __cause__ = None
    __class__ = &lt;class &apos;AssertionError&apos;&gt;
    __context__ = None
    __delattr__ = &lt;method-wrapper &apos;__delattr__&apos; of AssertionError object&gt;
    __dict__ = {}
    __dir__ = &lt;built-in method __dir__ of AssertionError object&gt;
    __doc__ = &apos;Assertion failed.&apos;
    __eq__ = &lt;method-wrapper &apos;__eq__&apos; of AssertionError object&gt;
    __format__ = &lt;built-in method __format__ of AssertionError object&gt;
    __ge__ = &lt;method-wrapper &apos;__ge__&apos; of AssertionError object&gt;
    __getattribute__ = &lt;method-wrapper &apos;__getattribute__&apos; of AssertionError object&gt;
    __gt__ = &lt;method-wrapper &apos;__gt__&apos; of AssertionError object&gt;
    __hash__ = &lt;method-wrapper &apos;__hash__&apos; of AssertionError object&gt;
    __init__ = &lt;method-wrapper &apos;__init__&apos; of AssertionError object&gt;
    __init_subclass__ = &lt;built-in method __init_subclass__ of type object&gt;
    __le__ = &lt;method-wrapper &apos;__le__&apos; of AssertionError object&gt;
    __lt__ = &lt;method-wrapper &apos;__lt__&apos; of AssertionError object&gt;
    __ne__ = &lt;method-wrapper &apos;__ne__&apos; of AssertionError object&gt;
    __new__ = &lt;built-in method __new__ of type object&gt;
    __reduce__ = &lt;built-in method __reduce__ of AssertionError object&gt;
    __reduce_ex__ = &lt;built-in method __reduce_ex__ of AssertionError object&gt;
    __repr__ = &lt;method-wrapper &apos;__repr__&apos; of AssertionError object&gt;
    __setattr__ = &lt;method-wrapper &apos;__setattr__&apos; of AssertionError object&gt;
    __setstate__ = &lt;built-in method __setstate__ of AssertionError object&gt;
    __sizeof__ = &lt;built-in method __sizeof__ of AssertionError object&gt;
    __str__ = &lt;method-wrapper &apos;__str__&apos; of AssertionError object&gt;
    __subclasshook__ = &lt;built-in method __subclasshook__ of type object&gt;
    __suppress_context__ = False
    __traceback__ = &lt;traceback object&gt;
    args = ()
    with_traceback = &lt;built-in method with_traceback of AssertionError object&gt;

The above is a description of an error in a Python program.  Here is
the original traceback:

Traceback (most recent call last):
  File &quot;/contrail-test/tcutils/wrappers.py&quot;, line 80, in wrapper
    result = function(self, *args, **kwargs)
  File &quot;/contrail-test/serial_scripts/vm_regression/test_vm_serial.py&quot;, line 638, in test_control_node_switchover
    assert vm2_fixture.wait_till_vm_is_up()
AssertionError

</failure>

    </testcase>

    <testcase classname="serial_scripts.vm_regression.test_vm_serial.TestBasicVMVN0" name="test_process_restart_in_policy_between_vns[cb_sanity,sanity]" time="241.272">
      <failure type="testtools.testresult.real._StringException">Traceback (most recent call last):
testtools.testresult.real._StringException: Traceback (most recent call last):
  File &quot;/contrail-test/tcutils/wrappers.py&quot;, line 176, in wrapper
    raise TestFailed(&quot;\n &quot;.join(errmsg))
tcutils.cores.TestFailed: Test failed: AssertionError
Python 3.9.25: /usr/bin/python3
Mon Oct  5 05:42:53 2026

A problem occurred in a Python script.  Here is the sequence of
function calls leading up to the error, in the order they occurred.

 /contrail-test/tcutils/wrappers.py in wrapper(self=&lt;serial_scripts.vm_regression.test_vm_serial.Tes..._between_vns[cb_sanity,sanity] id=0x7f8f35613520&gt;, *args=(), **kwargs={})
   78             log.info(&apos;Initial checks done. Running the testcase now&apos;)
   79             log.info(&apos;&apos;)
   80             result = function(self, *args, **kwargs)
   81             if self.inputs.upgrade:
   82                 pid = os.getpid()
result = None
function = &lt;function TestBasicVMVN0.test_process_restart_in_policy_between_vns&gt;
self = &lt;serial_scripts.vm_regression.test_vm_serial.Tes..._between_vns[cb_sanity,sanity] id=0x7f8f35613520&gt;
args = ()
kwargs = {}

 /contrail-test/serial_scripts/vm_regression/test_vm_serial.py in test_process_restart_in_policy_between_vns(self=&lt;serial_scripts.vm_regression.test_vm_serial.Tes..._between_vns[cb_sanity,sanity] id=0x7f8f35613520&gt;)
  405         vm2_fixture = self.create_vm(vn2_fixture, vn2_vm1_name)
  406         assert vm1_fixture.wait_till_vm_is_up()
  407         assert vm2_fixture.wait_till_vm_is_up()
  408         assert vm1_fixture.ping_with_certainty(vm2_fixture.vm_ip)
  409 
vm2_fixture = &lt;VMFixture: ctest-vn2_vm1-30542495&gt;
vm2_fixture.wait_till_vm_is_up = &lt;bound method VMFixture.wait_till_vm_is_up of &lt;VMFixture: ctest-vn2_vm1-30542495&gt;&gt;
AssertionError: 
    __cause__ = None
    __class__ = &lt;class &apos;AssertionError&apos;&gt;
    __context__ = None
    __delattr__ = &lt;method-wrapper &apos;__delattr__&apos; of AssertionError object&gt;
    __dict__ = {}
    __dir__ = &lt;built-in method __dir__ of AssertionError object&gt;
    __doc__ = &apos;Assertion failed.&apos;
    __eq__ = &lt;method-wrapper &apos;__eq__&apos; of AssertionError object&gt;
    __format__ = &lt;built-in method __format__ of AssertionError object&gt;
    __ge__ = &lt;method-wrapper &apos;__ge__&apos; of AssertionError object&gt;
    __getattribute__ = &lt;method-wrapper &apos;__getattribute__&apos; of AssertionError object&gt;
    __gt__ = &lt;method-wrapper &apos;__gt__&apos; of AssertionError object&gt;
    __hash__ = &lt;method-wrapper &apos;__hash__&apos; of AssertionError object&gt;
    __init__ = &lt;method-wrapper &apos;__init__&apos; of AssertionError object&gt;
    __init_subclass__ = &lt;built-in method __init_subclass__ of type object&gt;
    __le__ = &lt;method-wrapper &apos;__le__&apos; of AssertionError object&gt;
    __lt__ = &lt;method-wrapper &apos;__lt__&apos; of AssertionError object&gt;
    __ne__ = &lt;method-wrapper &apos;__ne__&apos; of AssertionError object&gt;
    __new__ = &lt;built-in method __new__ of type object&gt;
    __reduce__ = &lt;built-in method __reduce__ of AssertionError object&gt;
    __reduce_ex__ = &lt;built-in method __reduce_ex__ of AssertionError object&gt;
    __repr__ = &lt;method-wrapper &apos;__repr__&apos; of AssertionError object&gt;
    __setattr__ = &lt;method-wrapper &apos;__setattr__&apos; of AssertionError object&gt;
    __setstate__ = &lt;built-in method __setstate__ of AssertionError object&gt;
    __sizeof__ = &lt;built-in method __sizeof__ of AssertionError object&gt;
    __str__ = &lt;method-wrapper &apos;__str__&apos; of AssertionError object&gt;
    __subclasshook__ = &lt;built-in method __subclasshook__ of type object&gt;
    __suppress_context__ = False
    __traceback__ = &lt;traceback object&gt;
    args = ()
    with_traceback = &lt;built-in method with_traceback of AssertionError object&gt;

The above is a description of an error in a Python program.  Here is
the original traceback:

Traceback (most recent call last):
  File &quot;/contrail-test/tcutils/wrappers.py&quot;, line 80, in wrapper
    result = function(self, *args, **kwargs)
  File &quot;/contrail-test/serial_scripts/vm_regression/test_vm_serial.py&quot;, line 407, in test_process_restart_in_policy_between_vns
    assert vm2_fixture.wait_till_vm_is_up()
AssertionError

</failure>

    </testcase>

    <testcase classname="serial_scripts.vm_regression.test_vm_serial.TestBasicVMVN0" name="test_underlay_broadcast_traffic_handling[sanity]" time="27.136" />

    <testcase classname="serial_scripts.vrouter.test_drop_stats.TestDropStats" name="test_flow_action_drop_stats[dev_reg,sanity]" time="373.677">
      <failure type="testtools.testresult.real._StringException">Traceback (most recent call last):
testtools.testresult.real._StringException: Traceback (most recent call last):
  File &quot;/contrail-test/tcutils/wrappers.py&quot;, line 176, in wrapper
    raise TestFailed(&quot;\n &quot;.join(errmsg))
tcutils.cores.TestFailed: Test failed: AssertionError
Python 3.9.25: /usr/bin/python3
Mon Oct  5 05:49:19 2026

A problem occurred in a Python script.  Here is the sequence of
function calls leading up to the error, in the order they occurred.

 /contrail-test/tcutils/wrappers.py in wrapper(self=&lt;serial_scripts.vrouter.test_drop_stats.TestDrop...ion_drop_stats[dev_reg,sanity] id=0x7f8f3561f610&gt;, *args=(), **kwargs={})
   78             log.info(&apos;Initial checks done. Running the testcase now&apos;)
   79             log.info(&apos;&apos;)
   80             result = function(self, *args, **kwargs)
   81             if self.inputs.upgrade:
   82                 pid = os.getpid()
result = None
function = &lt;function TestDropStats.test_flow_action_drop_stats&gt;
self = &lt;serial_scripts.vrouter.test_drop_stats.TestDrop...ion_drop_stats[dev_reg,sanity] id=0x7f8f3561f610&gt;
args = ()
kwargs = {}

 /contrail-test/serial_scripts/vrouter/test_drop_stats.py in test_flow_action_drop_stats(self=&lt;serial_scripts.vrouter.test_drop_stats.TestDrop...ion_drop_stats[dev_reg,sanity] id=0x7f8f3561f610&gt;)
   36             raise self.skipTest(&quot;Skipping test case,this test needs atleast 2 compute nodes&quot;)
   37 
   38         assert self.verify_flow_action_drop_stats()
   39         return True
   40     # end test_drop_stats
self = &lt;serial_scripts.vrouter.test_drop_stats.TestDrop...ion_drop_stats[dev_reg,sanity] id=0x7f8f3561f610&gt;
self.verify_flow_action_drop_stats = &lt;bound method BaseDropStats.verify_flow_action_d...on_drop_stats[dev_reg,sanity] id=0x7f8f3561f610&gt;&gt;

 /contrail-test/common/vrouter/base_drop_stats.py in verify_flow_action_drop_stats(self=&lt;serial_scripts.vrouter.test_drop_stats.TestDrop...ion_drop_stats[dev_reg,sanity] id=0x7f8f3561f610&gt;, drop_type=&apos;ds_flow_action_drop&apos;)
   45         compute1 = compute_ips[1]
   46         compute1_name = self.inputs.host_data[compute1][&apos;name&apos;]
   47         vm1_fixture, _, _, vm2_ip = self.create_verify_vn_vm(compute0_name, compute1_name, image_name)
   48 
   49         tap = vm1_fixture.get_tap_intf_of_vm()[0][&apos;name&apos;]
vm1_fixture undefined
_ undefined
vm2_ip undefined
self = &lt;serial_scripts.vrouter.test_drop_stats.TestDrop...ion_drop_stats[dev_reg,sanity] id=0x7f8f3561f610&gt;
self.create_verify_vn_vm = &lt;bound method BaseDropStats.create_verify_vn_vm ...on_drop_stats[dev_reg,sanity] id=0x7f8f3561f610&gt;&gt;
compute0_name = &apos;an-jenkins-deploy-platform-ansible-os-6343-1&apos;
compute1_name = &apos;an-jenkins-deploy-platform-ansible-os-6343-2&apos;
image_name = &apos;cirros&apos;

 /contrail-test/common/vrouter/base_drop_stats.py in create_verify_vn_vm(self=&lt;serial_scripts.vrouter.test_drop_stats.TestDrop...ion_drop_stats[dev_reg,sanity] id=0x7f8f3561f610&gt;, compute0_name=&apos;an-jenkins-deploy-platform-ansible-os-6343-1&apos;, compute1_name=&apos;an-jenkins-deploy-platform-ansible-os-6343-2&apos;, image_name=&apos;cirros&apos;)
  129         vm2_fixture.wait_till_vm_is_up()
  130         assert vm1_fixture.verify_on_setup()
  131         assert vm2_fixture.verify_on_setup()
  132         vm1_ip = vm1_fixture.get_vm_ips(vn1_fq_name)[0]
  133         vm2_ip = vm2_fixture.get_vm_ips(vn2_fq_name)[0]
vm2_fixture = &lt;VMFixture: ctest-vm2-37901184&gt;
vm2_fixture.verify_on_setup = &lt;bound method VMFixture.verify_on_setup of &lt;VMFixture: ctest-vm2-37901184&gt;&gt;
AssertionError: 
    __cause__ = None
    __class__ = &lt;class &apos;AssertionError&apos;&gt;
    __context__ = None
    __delattr__ = &lt;method-wrapper &apos;__delattr__&apos; of AssertionError object&gt;
    __dict__ = {}
    __dir__ = &lt;built-in method __dir__ of AssertionError object&gt;
    __doc__ = &apos;Assertion failed.&apos;
    __eq__ = &lt;method-wrapper &apos;__eq__&apos; of AssertionError object&gt;
    __format__ = &lt;built-in method __format__ of AssertionError object&gt;
    __ge__ = &lt;method-wrapper &apos;__ge__&apos; of AssertionError object&gt;
    __getattribute__ = &lt;method-wrapper &apos;__getattribute__&apos; of AssertionError object&gt;
    __gt__ = &lt;method-wrapper &apos;__gt__&apos; of AssertionError object&gt;
    __hash__ = &lt;method-wrapper &apos;__hash__&apos; of AssertionError object&gt;
    __init__ = &lt;method-wrapper &apos;__init__&apos; of AssertionError object&gt;
    __init_subclass__ = &lt;built-in method __init_subclass__ of type object&gt;
    __le__ = &lt;method-wrapper &apos;__le__&apos; of AssertionError object&gt;
    __lt__ = &lt;method-wrapper &apos;__lt__&apos; of AssertionError object&gt;
    __ne__ = &lt;method-wrapper &apos;__ne__&apos; of AssertionError object&gt;
    __new__ = &lt;built-in method __new__ of type object&gt;
    __reduce__ = &lt;built-in method __reduce__ of AssertionError object&gt;
    __reduce_ex__ = &lt;built-in method __reduce_ex__ of AssertionError object&gt;
    __repr__ = &lt;method-wrapper &apos;__repr__&apos; of AssertionError object&gt;
    __setattr__ = &lt;method-wrapper &apos;__setattr__&apos; of AssertionError object&gt;
    __setstate__ = &lt;built-in method __setstate__ of AssertionError object&gt;
    __sizeof__ = &lt;built-in method __sizeof__ of AssertionError object&gt;
    __str__ = &lt;method-wrapper &apos;__str__&apos; of AssertionError object&gt;
    __subclasshook__ = &lt;built-in method __subclasshook__ of type object&gt;
    __suppress_context__ = False
    __traceback__ = &lt;traceback object&gt;
    args = ()
    with_traceback = &lt;built-in method with_traceback of AssertionError object&gt;

The above is a description of an error in a Python program.  Here is
the original traceback:

Traceback (most recent call last):
  File &quot;/contrail-test/tcutils/wrappers.py&quot;, line 80, in wrapper
    result = function(self, *args, **kwargs)
  File &quot;/contrail-test/serial_scripts/vrouter/test_drop_stats.py&quot;, line 38, in test_flow_action_drop_stats
    assert self.verify_flow_action_drop_stats()
  File &quot;/contrail-test/common/vrouter/base_drop_stats.py&quot;, line 47, in verify_flow_action_drop_stats
    vm1_fixture, _, _, vm2_ip = self.create_verify_vn_vm(compute0_name, compute1_name, image_name)
  File &quot;/contrail-test/common/vrouter/base_drop_stats.py&quot;, line 131, in create_verify_vn_vm
    assert vm2_fixture.verify_on_setup()
AssertionError

</failure>

    </testcase>

    <testcase classname="serial_scripts.vrouter.test_fat_flow_aggr_serial.FatFlowAggrIpv6Serial" name="test_fat_flow_aggr_dest_udp_inter_vn_inter_node[dev_reg,sanity]" time="352.981">
      <failure type="testtools.testresult.real._StringException">Traceback (most recent call last):
testtools.testresult.real._StringException: Traceback (most recent call last):
  File &quot;/contrail-test/tcutils/wrappers.py&quot;, line 176, in wrapper
    raise TestFailed(&quot;\n &quot;.join(errmsg))
tcutils.cores.TestFailed: Test failed: TestFailed
Python 3.9.25: /usr/bin/python3
Mon Oct  5 05:55:40 2026

A problem occurred in a Python script.  Here is the sequence of
function calls leading up to the error, in the order they occurred.

 /contrail-test/tcutils/wrappers.py in wrapper(self=&lt;serial_scripts.vrouter.test_fat_flow_aggr_seria..._vn_inter_node[dev_reg,sanity] id=0x7f8f3561f9d0&gt;, *args=(), **kwargs={})
   78             log.info(&apos;Initial checks done. Running the testcase now&apos;)
   79             log.info(&apos;&apos;)
   80             result = function(self, *args, **kwargs)
   81             if self.inputs.upgrade:
   82                 pid = os.getpid()
result = None
function = &lt;function FatFlowAggrIpv6Serial.test_fat_flow_aggr_dest_udp_inter_vn_inter_node&gt;
self = &lt;serial_scripts.vrouter.test_fat_flow_aggr_seria..._vn_inter_node[dev_reg,sanity] id=0x7f8f3561f9d0&gt;
args = ()
kwargs = {}

 /contrail-test/serial_scripts/vrouter/test_fat_flow_aggr_serial.py in test_fat_flow_aggr_dest_udp_inter_vn_inter_node(self=&lt;serial_scripts.vrouter.test_fat_flow_aggr_seria..._vn_inter_node[dev_reg,sanity] id=0x7f8f3561f9d0&gt;)
   91 
   92         &quot;&quot;&quot;
   93         self.inputs.set_af(&apos;dual&apos;)
   94         super(FatFlowAggrIpv6Serial, self).test_fat_flow_aggr_dest_udp_inter_vn_inter_node()
   95 
builtinsuper = &lt;class &apos;super&apos;&gt;
global FatFlowAggrIpv6Serial = &lt;class &apos;serial_scripts.vrouter.test_fat_flow_aggr_serial.FatFlowAggrIpv6Serial&apos;&gt;
self = &lt;serial_scripts.vrouter.test_fat_flow_aggr_seria..._vn_inter_node[dev_reg,sanity] id=0x7f8f3561f9d0&gt;
).test_fat_flow_aggr_dest_udp_inter_vn_inter_node = &lt;bound method FatFlowAggrIpv6Serial.test_fat_flo...vn_inter_node[dev_reg,sanity] id=0x7f8f3561f9d0&gt;&gt;

 /contrail-test/tcutils/wrappers.py in wrapper(self=&lt;serial_scripts.vrouter.test_fat_flow_aggr_seria..._vn_inter_node[dev_reg,sanity] id=0x7f8f3561f9d0&gt;, *args=(), **kwargs={})
  174                 if &apos;ci_image&apos; in list(os.environ.keys()):
  175                     os.environ[&apos;stop_execution_flag&apos;] = &apos;set&apos;
  176                 raise TestFailed(&quot;\n &quot;.join(errmsg))
  177             elif testskip:
  178                 log.info(&apos;&apos;)
global TestFailed = &lt;class &apos;tcutils.cores.TestFailed&apos;&gt;
&quot;\n &quot;.join undefined
errmsg = [&apos;Test failed: AssertionError\nPython 3.9.25: /usr/...ert server.wait_till_vm_is_up()\nAssertionError\n\n\n&apos;]
TestFailed: Test failed: AssertionError
Python 3.9.25: /usr/bin/python3
Mon Oct  5 05:55:33 2026

A problem occurred in a Python script.  Here is the sequence of
function calls leading up to the error, in the order they occurred.

 /contrail-test/tcutils/wrappers.py in wrapper(self=&lt;serial_scripts.vrouter.test_fat_flow_aggr_seria..._vn_inter_node[dev_reg,sanity] id=0x7f8f3561f9d0&gt;, *args=(), **kwargs={})
   78             log.info(&apos;Initial checks done. Running the testcase now&apos;)
   79             log.info(&apos;&apos;)
   80             result = function(self, *args, **kwargs)
   81             if self.inputs.upgrade:
   82                 pid = os.getpid()
result = None
function = &lt;function FatFlowAggrSerial.test_fat_flow_aggr_dest_udp_inter_vn_inter_node&gt;
self = &lt;serial_scripts.vrouter.test_fat_flow_aggr_seria..._vn_inter_node[dev_reg,sanity] id=0x7f8f3561f9d0&gt;
args = ()
kwargs = {}

 /contrail-test/serial_scripts/vrouter/test_fat_flow_aggr_serial.py in test_fat_flow_aggr_dest_udp_inter_vn_inter_node(self=&lt;serial_scripts.vrouter.test_fat_flow_aggr_seria..._vn_inter_node[dev_reg,sanity] id=0x7f8f3561f9d0&gt;)
   56         policy_deny = False
   57         vn_policy = True
   58         self.fat_flow_with_prefix_aggr(prefix_length=prefix_length,
   59             inter_node=inter_node,inter_vn=inter_vn, proto=proto,
   60             port=port, vn_policy=vn_policy, policy_deny=policy_deny,
self = &lt;serial_scripts.vrouter.test_fat_flow_aggr_seria..._vn_inter_node[dev_reg,sanity] id=0x7f8f3561f9d0&gt;
self.fat_flow_with_prefix_aggr = &lt;bound method BaseVrouterTest.fat_flow_with_pref...vn_inter_node[dev_reg,sanity] id=0x7f8f3561f9d0&gt;&gt;
prefix_length = 29
inter_node = True
inter_vn = True
proto = &apos;udp&apos;
port = 55
vn_policy = True
policy_deny = False
dual undefined
ipv6 = True
prefix_length6 = 125
only_v6 = True

 /contrail-test/common/vrouter/base.py in fat_flow_with_prefix_aggr(self=&lt;serial_scripts.vrouter.test_fat_flow_aggr_seria..._vn_inter_node[dev_reg,sanity] id=0x7f8f3561f9d0&gt;, prefix_length=29, prefix_length6=125, inter_node=True, inter_vn=True, dual=True, traffic_recvr=False, unidirectional_traffic=True, ignore_address=None, proto=&apos;udp&apos;, port=55, portv6=56, svc_chain=False, only_v6=True, af=&apos;v4&apos;, icmp_error=False, hc=None, vn_policy=True, policy_deny=False, svm_inter_node=False, resources=True, scale=False)
  422                                         node_name=server_compute)
  423             for server in self.server_fixtures:
  424                 assert server.wait_till_vm_is_up()
  425 
  426         server_fixtures = self.server_fixtures
server = &lt;VMFixture: ctest-FatFlowAggrIpv6Serial-78426072-61459017&gt;
server.wait_till_vm_is_up = &lt;bound method VMFixture.wait_till_vm_is_up of &lt;V...: ctest-FatFlowAggrIpv6Serial-78426072-61459017&gt;&gt;
AssertionError: 
    __cause__ = None
    __class__ = &lt;class &apos;AssertionError&apos;&gt;
    __context__ = None
    __delattr__ = &lt;method-wrapper &apos;__delattr__&apos; of AssertionError object&gt;
    __dict__ = {}
    __dir__ = &lt;built-in method __dir__ of AssertionError object&gt;
    __doc__ = &apos;Assertion failed.&apos;
    __eq__ = &lt;method-wrapper &apos;__eq__&apos; of AssertionError object&gt;
    __format__ = &lt;built-in method __format__ of AssertionError object&gt;
    __ge__ = &lt;method-wrapper &apos;__ge__&apos; of AssertionError object&gt;
    __getattribute__ = &lt;method-wrapper &apos;__getattribute__&apos; of AssertionError object&gt;
    __gt__ = &lt;method-wrapper &apos;__gt__&apos; of AssertionError object&gt;
    __hash__ = &lt;method-wrapper &apos;__hash__&apos; of AssertionError object&gt;
    __init__ = &lt;method-wrapper &apos;__init__&apos; of AssertionError object&gt;
    __init_subclass__ = &lt;built-in method __init_subclass__ of type object&gt;
    __le__ = &lt;method-wrapper &apos;__le__&apos; of AssertionError object&gt;
    __lt__ = &lt;method-wrapper &apos;__lt__&apos; of AssertionError object&gt;
    __ne__ = &lt;method-wrapper &apos;__ne__&apos; of AssertionError object&gt;
    __new__ = &lt;built-in method __new__ of type object&gt;
    __reduce__ = &lt;built-in method __reduce__ of AssertionError object&gt;
    __reduce_ex__ = &lt;built-in method __reduce_ex__ of AssertionError object&gt;
    __repr__ = &lt;method-wrapper &apos;__repr__&apos; of AssertionError object&gt;
    __setattr__ = &lt;method-wrapper &apos;__setattr__&apos; of AssertionError object&gt;
    __setstate__ = &lt;built-in method __setstate__ of AssertionError object&gt;
    __sizeof__ = &lt;built-in method __sizeof__ of AssertionError object&gt;
    __str__ = &lt;method-wrapper &apos;__str__&apos; of AssertionError object&gt;
    __subclasshook__ = &lt;built-in method __subclasshook__ of type object&gt;
    __suppress_context__ = False
    __traceback__ = &lt;traceback object&gt;
    args = ()
    with_traceback = &lt;built-in method with_traceback of AssertionError object&gt;

The above is a description of an error in a Python program.  Here is
the original traceback:

Traceback (most recent call last):
  File &quot;/contrail-test/tcutils/wrappers.py&quot;, line 80, in wrapper
    result = function(self, *args, **kwargs)
  File &quot;/contrail-test/serial_scripts/vrouter/test_fat_flow_aggr_serial.py&quot;, line 58, in test_fat_flow_aggr_dest_udp_inter_vn_inter_node
    self.fat_flow_with_prefix_aggr(prefix_length=prefix_length,
  File &quot;/contrail-test/common/vrouter/base.py&quot;, line 424, in fat_flow_with_prefix_aggr
    assert server.wait_till_vm_is_up()
AssertionError



    __cause__ = None
    __class__ = &lt;class &apos;tcutils.cores.TestFailed&apos;&gt;
    __context__ = None
    __delattr__ = &lt;method-wrapper &apos;__delattr__&apos; of TestFailed object&gt;
    __dict__ = {}
    __dir__ = &lt;built-in method __dir__ of TestFailed object&gt;
    __doc__ = None
    __eq__ = &lt;method-wrapper &apos;__eq__&apos; of TestFailed object&gt;
    __format__ = &lt;built-in method __format__ of TestFailed object&gt;
    __ge__ = &lt;method-wrapper &apos;__ge__&apos; of TestFailed object&gt;
    __getattribute__ = &lt;method-wrapper &apos;__getattribute__&apos; of TestFailed object&gt;
    __gt__ = &lt;method-wrapper &apos;__gt__&apos; of TestFailed object&gt;
    __hash__ = &lt;method-wrapper &apos;__hash__&apos; of TestFailed object&gt;
    __init__ = &lt;method-wrapper &apos;__init__&apos; of TestFailed object&gt;
    __init_subclass__ = &lt;built-in method __init_subclass__ of type object&gt;
    __le__ = &lt;method-wrapper &apos;__le__&apos; of TestFailed object&gt;
    __lt__ = &lt;method-wrapper &apos;__lt__&apos; of TestFailed object&gt;
    __module__ = &apos;tcutils.cores&apos;
    __ne__ = &lt;method-wrapper &apos;__ne__&apos; of TestFailed object&gt;
    __new__ = &lt;built-in method __new__ of type object&gt;
    __reduce__ = &lt;built-in method __reduce__ of TestFailed object&gt;
    __reduce_ex__ = &lt;built-in method __reduce_ex__ of TestFailed object&gt;
    __repr__ = &lt;method-wrapper &apos;__repr__&apos; of TestFailed object&gt;
    __setattr__ = &lt;method-wrapper &apos;__setattr__&apos; of TestFailed object&gt;
    __setstate__ = &lt;built-in method __setstate__ of TestFailed object&gt;
    __sizeof__ = &lt;built-in method __sizeof__ of TestFailed object&gt;
    __str__ = &lt;method-wrapper &apos;__str__&apos; of TestFailed object&gt;
    __subclasshook__ = &lt;built-in method __subclasshook__ of type object&gt;
    __suppress_context__ = False
    __traceback__ = &lt;traceback object&gt;
    __weakref__ = None
    args = (&apos;Test failed: AssertionError\nPython 3.9.25: /usr/...ert server.wait_till_vm_is_up()\nAssertionError\n\n\n&apos;,)
    with_traceback = &lt;built-in method with_traceback of TestFailed object&gt;

The above is a description of an error in a Python program.  Here is
the original traceback:

Traceback (most recent call last):
  File &quot;/contrail-test/tcutils/wrappers.py&quot;, line 80, in wrapper
    result = function(self, *args, **kwargs)
  File &quot;/contrail-test/serial_scripts/vrouter/test_fat_flow_aggr_serial.py&quot;, line 94, in test_fat_flow_aggr_dest_udp_inter_vn_inter_node
    super(FatFlowAggrIpv6Serial, self).test_fat_flow_aggr_dest_udp_inter_vn_inter_node()
  File &quot;/contrail-test/tcutils/wrappers.py&quot;, line 176, in wrapper
    raise TestFailed(&quot;\n &quot;.join(errmsg))
tcutils.cores.TestFailed: Test failed: AssertionError
Python 3.9.25: /usr/bin/python3
Mon Oct  5 05:55:33 2026

A problem occurred in a Python script.  Here is the sequence of
function calls leading up to the error, in the order they occurred.

 /contrail-test/tcutils/wrappers.py in wrapper(self=&lt;serial_scripts.vrouter.test_fat_flow_aggr_seria..._vn_inter_node[dev_reg,sanity] id=0x7f8f3561f9d0&gt;, *args=(), **kwargs={})
   78             log.info(&apos;Initial checks done. Running the testcase now&apos;)
   79             log.info(&apos;&apos;)
   80             result = function(self, *args, **kwargs)
   81             if self.inputs.upgrade:
   82                 pid = os.getpid()
result = None
function = &lt;function FatFlowAggrSerial.test_fat_flow_aggr_dest_udp_inter_vn_inter_node&gt;
self = &lt;serial_scripts.vrouter.test_fat_flow_aggr_seria..._vn_inter_node[dev_reg,sanity] id=0x7f8f3561f9d0&gt;
args = ()
kwargs = {}

 /contrail-test/serial_scripts/vrouter/test_fat_flow_aggr_serial.py in test_fat_flow_aggr_dest_udp_inter_vn_inter_node(self=&lt;serial_scripts.vrouter.test_fat_flow_aggr_seria..._vn_inter_node[dev_reg,sanity] id=0x7f8f3561f9d0&gt;)
   56         policy_deny = False
   57         vn_policy = True
   58         self.fat_flow_with_prefix_aggr(prefix_length=prefix_length,
   59             inter_node=inter_node,inter_vn=inter_vn, proto=proto,
   60             port=port, vn_policy=vn_policy, policy_deny=policy_deny,
self = &lt;serial_scripts.vrouter.test_fat_flow_aggr_seria..._vn_inter_node[dev_reg,sanity] id=0x7f8f3561f9d0&gt;
self.fat_flow_with_prefix_aggr = &lt;bound method BaseVrouterTest.fat_flow_with_pref...vn_inter_node[dev_reg,sanity] id=0x7f8f3561f9d0&gt;&gt;
prefix_length = 29
inter_node = True
inter_vn = True
proto = &apos;udp&apos;
port = 55
vn_policy = True
policy_deny = False
dual undefined
ipv6 = True
prefix_length6 = 125
only_v6 = True

 /contrail-test/common/vrouter/base.py in fat_flow_with_prefix_aggr(self=&lt;serial_scripts.vrouter.test_fat_flow_aggr_seria..._vn_inter_node[dev_reg,sanity] id=0x7f8f3561f9d0&gt;, prefix_length=29, prefix_length6=125, inter_node=True, inter_vn=True, dual=True, traffic_recvr=False, unidirectional_traffic=True, ignore_address=None, proto=&apos;udp&apos;, port=55, portv6=56, svc_chain=False, only_v6=True, af=&apos;v4&apos;, icmp_error=False, hc=None, vn_policy=True, policy_deny=False, svm_inter_node=False, resources=True, scale=False)
  422                                         node_name=server_compute)
  423             for server in self.server_fixtures:
  424                 assert server.wait_till_vm_is_up()
  425 
  426         server_fixtures = self.server_fixtures
server = &lt;VMFixture: ctest-FatFlowAggrIpv6Serial-78426072-61459017&gt;
server.wait_till_vm_is_up = &lt;bound method VMFixture.wait_till_vm_is_up of &lt;V...: ctest-FatFlowAggrIpv6Serial-78426072-61459017&gt;&gt;
AssertionError: 
    __cause__ = None
    __class__ = &lt;class &apos;AssertionError&apos;&gt;
    __context__ = None
    __delattr__ = &lt;method-wrapper &apos;__delattr__&apos; of AssertionError object&gt;
    __dict__ = {}
    __dir__ = &lt;built-in method __dir__ of AssertionError object&gt;
    __doc__ = &apos;Assertion failed.&apos;
    __eq__ = &lt;method-wrapper &apos;__eq__&apos; of AssertionError object&gt;
    __format__ = &lt;built-in method __format__ of AssertionError object&gt;
    __ge__ = &lt;method-wrapper &apos;__ge__&apos; of AssertionError object&gt;
    __getattribute__ = &lt;method-wrapper &apos;__getattribute__&apos; of AssertionError object&gt;
    __gt__ = &lt;method-wrapper &apos;__gt__&apos; of AssertionError object&gt;
    __hash__ = &lt;method-wrapper &apos;__hash__&apos; of AssertionError object&gt;
    __init__ = &lt;method-wrapper &apos;__init__&apos; of AssertionError object&gt;
    __init_subclass__ = &lt;built-in method __init_subclass__ of type object&gt;
    __le__ = &lt;method-wrapper &apos;__le__&apos; of AssertionError object&gt;
    __lt__ = &lt;method-wrapper &apos;__lt__&apos; of AssertionError object&gt;
    __ne__ = &lt;method-wrapper &apos;__ne__&apos; of AssertionError object&gt;
    __new__ = &lt;built-in method __new__ of type object&gt;
    __reduce__ = &lt;built-in method __reduce__ of AssertionError object&gt;
    __reduce_ex__ = &lt;built-in method __reduce_ex__ of AssertionError object&gt;
    __repr__ = &lt;method-wrapper &apos;__repr__&apos; of AssertionError object&gt;
    __setattr__ = &lt;method-wrapper &apos;__setattr__&apos; of AssertionError object&gt;
    __setstate__ = &lt;built-in method __setstate__ of AssertionError object&gt;
    __sizeof__ = &lt;built-in method __sizeof__ of AssertionError object&gt;
    __str__ = &lt;method-wrapper &apos;__str__&apos; of AssertionError object&gt;
    __subclasshook__ = &lt;built-in method __subclasshook__ of type object&gt;
    __suppress_context__ = False
    __traceback__ = &lt;traceback object&gt;
    args = ()
    with_traceback = &lt;built-in method with_traceback of AssertionError object&gt;

The above is a description of an error in a Python program.  Here is
the original traceback:

Traceback (most recent call last):
  File &quot;/contrail-test/tcutils/wrappers.py&quot;, line 80, in wrapper
    result = function(self, *args, **kwargs)
  File &quot;/contrail-test/serial_scripts/vrouter/test_fat_flow_aggr_serial.py&quot;, line 58, in test_fat_flow_aggr_dest_udp_inter_vn_inter_node
    self.fat_flow_with_prefix_aggr(prefix_length=prefix_length,
  File &quot;/contrail-test/common/vrouter/base.py&quot;, line 424, in fat_flow_with_prefix_aggr
    assert server.wait_till_vm_is_up()
AssertionError

</failure>

    </testcase>

    <testcase classname="serial_scripts.vrouter.test_fat_flow_serial.FatFlowSerialIpv6" name="test_fat_flow_intra_vn_inter_node[cb_sanity,sanity]" time="304.329">
      <failure type="testtools.testresult.real._StringException">Traceback (most recent call last):
testtools.testresult.real._StringException: Traceback (most recent call last):
  File &quot;/contrail-test/serial_scripts/vrouter/test_fat_flow_serial.py&quot;, line 600, in test_fat_flow_intra_vn_inter_node
    super(FatFlowSerialIpv6, self).test_fat_flow_intra_vn_inter_node()
  File &quot;/contrail-test/tcutils/wrappers.py&quot;, line 176, in wrapper
    raise TestFailed(&quot;\n &quot;.join(errmsg))
tcutils.cores.TestFailed: Test failed: AssertionError
Python 3.9.25: /usr/bin/python3
Mon Oct  5 06:00:43 2026

A problem occurred in a Python script.  Here is the sequence of
function calls leading up to the error, in the order they occurred.

 /contrail-test/tcutils/wrappers.py in wrapper(self=&lt;serial_scripts.vrouter.test_fat_flow_serial.Fat...n_inter_node[cb_sanity,sanity] id=0x7f8f355b36a0&gt;, *args=(), **kwargs={})
   78             log.info(&apos;Initial checks done. Running the testcase now&apos;)
   79             log.info(&apos;&apos;)
   80             result = function(self, *args, **kwargs)
   81             if self.inputs.upgrade:
   82                 pid = os.getpid()
result = None
function = &lt;function FatFlowSerial.test_fat_flow_intra_vn_inter_node&gt;
self = &lt;serial_scripts.vrouter.test_fat_flow_serial.Fat...n_inter_node[cb_sanity,sanity] id=0x7f8f355b36a0&gt;
args = ()
kwargs = {}

 /contrail-test/serial_scripts/vrouter/test_fat_flow_serial.py in test_fat_flow_intra_vn_inter_node(self=&lt;serial_scripts.vrouter.test_fat_flow_serial.Fat...n_inter_node[cb_sanity,sanity] id=0x7f8f355b36a0&gt;)
   43                                     node_name=compute_hosts[1])
   44         self.verify_vms(client_fixtures)
   45         self.verify_vms(server_fixtures)
   46 
   47         #Configure Fat flow on server VM
self = &lt;serial_scripts.vrouter.test_fat_flow_serial.Fat...n_inter_node[cb_sanity,sanity] id=0x7f8f355b36a0&gt;
self.verify_vms = &lt;bound method BaseVrouterTest.verify_vms of &lt;ser..._inter_node[cb_sanity,sanity] id=0x7f8f355b36a0&gt;&gt;
server_fixtures = [&lt;VMFixture: ctest-FatFlowSerialIpv6-40853079-45089725&gt;]

 /contrail-test/common/vrouter/base.py in verify_vms(self=&lt;serial_scripts.vrouter.test_fat_flow_serial.Fat...n_inter_node[cb_sanity,sanity] id=0x7f8f355b36a0&gt;, vm_fixtures=[&lt;VMFixture: ctest-FatFlowSerialIpv6-40853079-45089725&gt;])
  198     def verify_vms(self, vm_fixtures):
  199         for vm_fixture in vm_fixtures:
  200             assert vm_fixture.wait_till_vm_is_up()
  201 
  202     def add_static_routes_on_vms(self,prefix, vm_fixtures, ip=None):
vm_fixture = &lt;VMFixture: ctest-FatFlowSerialIpv6-40853079-45089725&gt;
vm_fixture.wait_till_vm_is_up = &lt;bound method VMFixture.wait_till_vm_is_up of &lt;V...ture: ctest-FatFlowSerialIpv6-40853079-45089725&gt;&gt;
AssertionError: 
    __cause__ = None
    __class__ = &lt;class &apos;AssertionError&apos;&gt;
    __context__ = None
    __delattr__ = &lt;method-wrapper &apos;__delattr__&apos; of AssertionError object&gt;
    __dict__ = {}
    __dir__ = &lt;built-in method __dir__ of AssertionError object&gt;
    __doc__ = &apos;Assertion failed.&apos;
    __eq__ = &lt;method-wrapper &apos;__eq__&apos; of AssertionError object&gt;
    __format__ = &lt;built-in method __format__ of AssertionError object&gt;
    __ge__ = &lt;method-wrapper &apos;__ge__&apos; of AssertionError object&gt;
    __getattribute__ = &lt;method-wrapper &apos;__getattribute__&apos; of AssertionError object&gt;
    __gt__ = &lt;method-wrapper &apos;__gt__&apos; of AssertionError object&gt;
    __hash__ = &lt;method-wrapper &apos;__hash__&apos; of AssertionError object&gt;
    __init__ = &lt;method-wrapper &apos;__init__&apos; of AssertionError object&gt;
    __init_subclass__ = &lt;built-in method __init_subclass__ of type object&gt;
    __le__ = &lt;method-wrapper &apos;__le__&apos; of AssertionError object&gt;
    __lt__ = &lt;method-wrapper &apos;__lt__&apos; of AssertionError object&gt;
    __ne__ = &lt;method-wrapper &apos;__ne__&apos; of AssertionError object&gt;
    __new__ = &lt;built-in method __new__ of type object&gt;
    __reduce__ = &lt;built-in method __reduce__ of AssertionError object&gt;
    __reduce_ex__ = &lt;built-in method __reduce_ex__ of AssertionError object&gt;
    __repr__ = &lt;method-wrapper &apos;__repr__&apos; of AssertionError object&gt;
    __setattr__ = &lt;method-wrapper &apos;__setattr__&apos; of AssertionError object&gt;
    __setstate__ = &lt;built-in method __setstate__ of AssertionError object&gt;
    __sizeof__ = &lt;built-in method __sizeof__ of AssertionError object&gt;
    __str__ = &lt;method-wrapper &apos;__str__&apos; of AssertionError object&gt;
    __subclasshook__ = &lt;built-in method __subclasshook__ of type object&gt;
    __suppress_context__ = False
    __traceback__ = &lt;traceback object&gt;
    args = ()
    with_traceback = &lt;built-in method with_traceback of AssertionError object&gt;

The above is a description of an error in a Python program.  Here is
the original traceback:

Traceback (most recent call last):
  File &quot;/contrail-test/tcutils/wrappers.py&quot;, line 80, in wrapper
    result = function(self, *args, **kwargs)
  File &quot;/contrail-test/serial_scripts/vrouter/test_fat_flow_serial.py&quot;, line 45, in test_fat_flow_intra_vn_inter_node
    self.verify_vms(server_fixtures)
  File &quot;/contrail-test/common/vrouter/base.py&quot;, line 200, in verify_vms
    assert vm_fixture.wait_till_vm_is_up()
AssertionError

</failure>

    </testcase>

    <testcase classname="serial_scripts.xmpp.test_xmpp_auth.TestXmpptests" name="test_precedence_xmpp_auth[sanity]" time="2.649">
      <skipped>Xmpp auth should be set before running tests</skipped>

    </testcase>

    <testcase classname="serial_scripts.xmpp.test_xmpp_auth.TestXmpptests" name="test_undo_xmpp_auth[sanity]" time="2.669">
      <skipped>Xmpp auth should be set before running tests</skipped>

    </testcase>

  </testsuite>
</testsuites>
