2025-07-19 08:00:05,127 - INFO - Domain Default found not creating
2025-07-19 08:00:05,532 - INFO - Project ctest-AnalyticsBasicTestSanity-88476517 not found, creating it
2025-07-19 08:00:06,371 - INFO - Created Project:ctest-AnalyticsBasicTestSanity-88476517, ID : a778f4ac-ef1a-4900-bedb-829f6fbecf1d
2025-07-19 08:00:08,668 - INFO - ================================================================================
2025-07-19 08:00:08,669 - INFO - STARTING TEST : test_verify_object_logs
2025-07-19 08:00:08,669 - INFO - TEST DESCRIPTION :
Description: Test to validate object logs
1.Create vn/vm and verify object log tables updated with
those vn, vm and routing-instance - fails otherwise
Maintainer: sandipd@juniper.net
2025-07-19 08:00:08,878 - DEBUG - Nothing to compare xmpp stats {'10.0.0.137': {'10.20.0.25': '0'}} with
2025-07-19 08:00:08,878 - INFO - Initial checks done. Running the testcase now
2025-07-19 08:00:08,879 - INFO -
2025-07-19 08:00:10,317 - DEBUG - Response for create_network : {'network': {'id': 'e61397d9-8a1b-4fc7-a421-cbf4f70cbc1d', 'name': 'ctest-vn22-70845716', 'tenant_id': 'a778f4acef1a4900bedb829f6fbecf1d', 'project_id': 'a778f4acef1a4900bedb829f6fbecf1d', 'admin_state_up': True, 'shared': False, 'status': 'ACTIVE', 'router:external': False, 'mtu': 0, 'subnets': [], 'fq_name': ['default-domain', 'ctest-AnalyticsBasicTestSanity-88476517', 'ctest-vn22-70845716'], 'port_security_enabled': True, 'description': ''}}
2025-07-19 08:00:10,636 - DEBUG - Response for create_subnet : {'subnet': {'id': 'f30bf060-bd8a-4b9b-8599-9920df1a65c7', 'name': '', 'tenant_id': 'a778f4acef1a4900bedb829f6fbecf1d', 'network_id': 'e61397d9-8a1b-4fc7-a421-cbf4f70cbc1d', 'ip_version': 4, 'cidr': '129.195.100.128/26', 'allocation_pools': [{'start': '129.195.100.130', 'end': '129.195.100.190'}], 'gateway_ip': '129.195.100.129', 'enable_dhcp': True, 'ipv6_ra_mode': None, 'ipv6_address_mode': None, 'dns_nameservers': [], 'host_routes': [], 'dns_server_address': '129.195.100.130', 'tags': [], 'project_id': 'a778f4acef1a4900bedb829f6fbecf1d'}}
2025-07-19 08:00:10,688 - INFO - Created VN ctest-vn22-70845716
2025-07-19 08:00:10,762 - DEBUG - VN ctest-vn22-70845716 UUID is e61397d9-8a1b-4fc7-a421-cbf4f70cbc1d
2025-07-19 08:00:10,945 - DEBUG - Requesting: http://10.0.0.137:8082/domains
2025-07-19 08:00:11,310 - DEBUG - Requesting: http://10.0.0.137:8082/domains
2025-07-19 08:00:11,386 - DEBUG - Requesting: http://10.0.0.137:8082/domain/e85714c0-96bb-499f-a57f-4baef17f0cda
2025-07-19 08:00:11,436 - DEBUG - Requesting: http://10.0.0.137:8082/project/a778f4ac-ef1a-4900-bedb-829f6fbecf1d
2025-07-19 08:00:11,527 - DEBUG - Requesting: http://10.0.0.137:8082/virtual-network/e61397d9-8a1b-4fc7-a421-cbf4f70cbc1d
2025-07-19 08:00:11,560 - DEBUG - Requesting: http://10.0.0.137:8082/virtual-network/e61397d9-8a1b-4fc7-a421-cbf4f70cbc1d
2025-07-19 08:00:11,588 - DEBUG - Requesting: http://10.0.0.137:8082/routing-instance/07559808-9e9a-46be-8a8f-1690261bff19
2025-07-19 08:00:11,609 - DEBUG - Requesting: http://10.0.0.137:8082/routing-instance/07559808-9e9a-46be-8a8f-1690261bff19
2025-07-19 08:00:11,633 - DEBUG - Requesting: http://10.0.0.137:8082/route-target/6433df9f-a4c9-4a4a-b873-2b68ec83f8a5
2025-07-19 08:00:11,656 - DEBUG - Route Targets: ['target:64512:8000005']
2025-07-19 08:00:11,656 - DEBUG - Requesting: http://10.0.0.137:8082/virtual-network/e61397d9-8a1b-4fc7-a421-cbf4f70cbc1d
2025-07-19 08:00:11,686 - DEBUG - Requesting: http://10.0.0.137:8082/routing-instance/07559808-9e9a-46be-8a8f-1690261bff19
2025-07-19 08:00:11,722 - INFO - Verified VN network id 6 for VN e61397d9-8a1b-4fc7-a421-cbf4f70cbc1d
2025-07-19 08:00:11,723 - INFO - Verifications in API Server for VN ctest-vn22-70845716 passed
2025-07-19 08:00:11,723 - DEBUG - Requesting: http://10.0.0.137:8082/virtual-network/e61397d9-8a1b-4fc7-a421-cbf4f70cbc1d
2025-07-19 08:00:11,751 - DEBUG - Requesting: http://10.0.0.137:8082/routing-instance/07559808-9e9a-46be-8a8f-1690261bff19
2025-07-19 08:00:11,773 - DEBUG - Requesting: http://10.0.0.137:8082/routing-instance/07559808-9e9a-46be-8a8f-1690261bff19
2025-07-19 08:00:11,795 - DEBUG - Requesting: http://10.0.0.137:8082/route-target/6433df9f-a4c9-4a4a-b873-2b68ec83f8a5
2025-07-19 08:00:11,814 - DEBUG - Requesting: http://10.0.0.137:8083/Snh_IFMapTableShowReq?table_name=virtual-network&search_string=virtual-network:default-domain:ctest-AnalyticsBasicTestSanity-88476517:ctest-vn22-70845716
2025-07-19 08:00:11,833 - DEBUG - Control-node 10.0.0.137 : VN object is : {'node_name': 'virtual-network:default-domain:ctest-AnalyticsBasicTestSanity-88476517:ctest-vn22-70845716', 'interests': '-', 'advertised': '-', 'dbentryflags': None, 'obj_info': {'sequence_number': '0', 'origin': 'Cassandra', 'data': {'id-perms': {'permissions': {'owner': 'ctest-AnalyticsBasicTestSanity-88476517', 'owner-access': '7', 'group': 'admin', 'group-access': '7', 'other-access': '7'}, 'uuid': {'uuid-mslong': '16578761613861670855', 'uuid-lslong': '11826958349428898845'}, 'enable': 'true', 'created': '2025-07-19T08:00:10', 'last-modified': '2025-07-19T08:00:10', 'description': None, 'user-visible': 'true', 'creator': None}}}, 'neighbors': None, 'last_modified': '00:00:01.281018'}
2025-07-19 08:00:11,833 - DEBUG - Requesting: http://10.0.0.137:8083/Snh_ShowRoutingInstanceReq?name=default-domain:ctest-AnalyticsBasicTestSanity-88476517:ctest-vn22-70845716:ctest-vn22-70845716
2025-07-19 08:00:11,854 - DEBUG - Route Targets: ['target:64512:8000005']
2025-07-19 08:00:11,854 - INFO - On all control nodes, Config, RI and RT verification for VN ctest-vn22-70845716 passed
2025-07-19 08:00:11,856 - DEBUG - ====Verifying policy data for ctest-vn22-70845716 in API_Server ======
2025-07-19 08:00:11,856 - DEBUG - Requesting: http://10.0.0.137:8082/domains
2025-07-19 08:00:11,875 - DEBUG - Requesting: http://10.0.0.137:8082/domain/e85714c0-96bb-499f-a57f-4baef17f0cda
2025-07-19 08:00:11,921 - DEBUG - Requesting: http://10.0.0.137:8082/project/a778f4ac-ef1a-4900-bedb-829f6fbecf1d
2025-07-19 08:00:12,055 - DEBUG - Requesting: http://10.0.0.137:8082/virtual-network/e61397d9-8a1b-4fc7-a421-cbf4f70cbc1d
2025-07-19 08:00:12,084 - DEBUG - =>VN ctest-vn22-70845716 has no policy to be verified
2025-07-19 08:00:12,084 - DEBUG - Verifying the vn in opserver
2025-07-19 08:00:12,084 - DEBUG - Verifying the default-domain:ctest-AnalyticsBasicTestSanity-88476517:ctest-vn22-70845716 virtual network link through opserver 10.0.0.137
2025-07-19 08:00:12,084 - DEBUG - Requesting: http://10.0.0.137:8081/analytics/uves/virtual-networks
2025-07-19 08:00:12,448 - DEBUG - Requesting: http://10.0.0.137:8081/analytics/uves/virtual-networks
2025-07-19 08:00:12,571 - DEBUG - vn link and name as {'name': 'default-domain:ctest-AnalyticsBasicTestSanity-88476517:ctest-vn22-70845716', 'href': 'http://10.0.0.137:8081/analytics/uves/virtual-network/default-domain:ctest-AnalyticsBasicTestSanity-88476517:ctest-vn22-70845716?flat'}
2025-07-19 08:00:12,571 - INFO - Validated that VN default-domain:ctest-AnalyticsBasicTestSanity-88476517:ctest-vn22-70845716 is found in opserver
2025-07-19 08:00:12,608 - DEBUG - Do not have enough data to verify VN in agent
2025-07-19 08:00:12,628 - DEBUG - VRF ids for VN ctest-vn22-70845716: {}
2025-07-19 08:00:12,844 - DEBUG - Services list from nova: [, , ]
2025-07-19 08:00:13,020 - DEBUG - Image by name cirros not found
2025-07-19 08:00:13,020 - DEBUG - Installing image cirros
2025-07-19 08:00:13,020 - DEBUG - Image info {'name': 'cirros-0.3.0-x86_64-disk.vmdk.gz', 'webserver': '', 'location': '/images/converts/', 'username': 'cirros', 'password': 'cubswin:)', 'type': 'os', 'flavor': 'contrail_flavor_tiny', 'params': '--container-format bare --disk-format vmdk --property vmware_disktype="sparse" --property vmware_adaptertype="ide" --property hw_scsi_model=virtio-scsi --property hw_disk_bus_model=virtio-scsi --property hw_disk_bus=virtio', 'name_docker': 'phusion-baseimage-enablesshd'}
2025-07-19 08:00:13,022 - DEBUG - Image build path http://nexus.opensdn.io/repository///images/converts//cirros-0.3.0-x86_64-disk.vmdk.gz
2025-07-19 08:00:13,023 - DEBUG - Download image from web http://nexus.opensdn.io/repository///images/converts//cirros-0.3.0-x86_64-disk.vmdk.gz
2025-07-19 08:00:13,054 - DEBUG - Image download (local=True) (proxy=None): Execute cmd: wget -nv http://nexus.opensdn.io/repository///images/converts//cirros-0.3.0-x86_64-disk.vmdk.gz -O /contrail-test/images/cirros-0.3.0-x86_64-disk.vmdk.gz
2025-07-19 08:00:13,162 - DEBUG - Image has been downloaded to /contrail-test/images/cirros-0.3.0-x86_64-disk.vmdk.gz
2025-07-19 08:00:13,163 - DEBUG - Unzip image
2025-07-19 08:00:13,163 - DEBUG - Image download (local=True) (proxy=None): Execute cmd: gunzip -f /contrail-test/images/cirros-0.3.0-x86_64-disk.vmdk.gz
2025-07-19 08:00:13,301 - DEBUG - Try to create image in user context
2025-07-19 08:00:13,726 - DEBUG - Image has been created in user context
2025-07-19 08:00:13,726 - DEBUG - Image download (local=True) (proxy=None): Execute cmd: rm -f /contrail-test/images/cirros-0.3.0-x86_64-disk.vmdk
2025-07-19 08:00:13,755 - DEBUG - Downloaded image has been removed
2025-07-19 08:00:13,817 - DEBUG - Uploaded image status = active
2025-07-19 08:00:17,426 - INFO - VM ([]) created on node: (cn-jenkins-deploy-platform-ansible-os-3668-1), Zone: (nova:cn-jenkins-deploy-platform-ansible-os-3668-1)
2025-07-19 08:00:17,502 - DEBUG - VM is still in BUILD state, Expected: ACTIVE
2025-07-19 08:00:22,756 - DEBUG - VM is still in BUILD state, Expected: ACTIVE
2025-07-19 08:00:27,939 - DEBUG - VM is in ACTIVE state now
2025-07-19 08:00:27,940 - DEBUG - Verifying ObjectVNTable for vn default-domain:ctest-AnalyticsBasicTestSanity-88476517:ctest-vn22-70845716 on analytics node 10.0.0.137
2025-07-19 08:00:27,950 - DEBUG - Posting: http://10.0.0.137:8081/analytics/query, payload {'table': 'ObjectVNTable', 'start_time': 1752912008880226, 'end_time': 1752912027950647, 'select_fields': ['ObjectId', 'Source', 'ObjectLog', 'SystemLog', 'Messagetype', 'ModuleId', 'MessageTS'], 'where': [[{'name': 'ObjectId', 'value': 'default-domain:ctest-AnalyticsBasicTestSanity-88476517:ctest-vn22-70845716', 'op': 1, 'value2': None}]]}
2025-07-19 08:02:27,960 - DEBUG - Got exception HTTPConnectionPool(host='10.0.0.137', port=8081): Read timed out. (read timeout=120)
2025-07-19 08:02:27,960 - DEBUG - Query output : []
2025-07-19 08:02:27,961 - DEBUG - Requesting: http://10.0.0.137:8081/analytics/send-tracebuffer/cn-jenkins-deploy-platform-ansible-os-3668-1./contrail-query-engine/0/QeTraceBuf
2025-07-19 08:02:27,999 - DEBUG - Status: {'status': 'pass'}
2025-07-19 08:02:28,025 - INFO - Deleting VM ctest-AnalyticsBasicTestSanity-88476517-53127918
2025-07-19 08:02:28,318 - INFO - Deleting VN ctest-vn22-70845716
2025-07-19 08:02:28,408 - DEBUG - VN e61397d9-8a1b-4fc7-a421-cbf4f70cbc1d still in use: Unable to complete operation on network e61397d9-8a1b-4fc7-a421-cbf4f70cbc1d. There are one or more ports still in use on the network.
Neutron server returns request_ids: ['req-ed77e87a-f79e-4b4a-9f79-e9b1fe21530b']
2025-07-19 08:02:28,408 - WARNING - Deleting VN ctest-vn22-70845716 failed..Will retry
2025-07-19 08:02:30,622 - DEBUG - Response for deleting network ()
2025-07-19 08:02:30,622 - DEBUG - Requesting: http://10.0.0.137:8082/routing-instance/07559808-9e9a-46be-8a8f-1690261bff19
2025-07-19 08:02:30,633 - DEBUG - Response Code: 404
2025-07-19 08:02:30,633 - DEBUG - Requesting: http://10.0.0.137:8082/domains
2025-07-19 08:02:30,640 - DEBUG - Requesting: http://10.0.0.137:8082/domain/e85714c0-96bb-499f-a57f-4baef17f0cda
2025-07-19 08:02:30,696 - DEBUG - Requesting: http://10.0.0.137:8082/project/a778f4ac-ef1a-4900-bedb-829f6fbecf1d
2025-07-19 08:02:30,826 - INFO - Validated that VN ctest-vn22-70845716 is not found in API Server
2025-07-19 08:02:30,864 - DEBUG - VN ctest-vn22-70845716 is not present in Agent 10.0.0.137
2025-07-19 08:02:30,864 - INFO - Validated that VN ctest-vn22-70845716 is not in any agent
2025-07-19 08:02:30,882 - DEBUG - Requesting: http://10.0.0.137:8083/Snh_ShowRoutingInstanceReq?name=default-domain:ctest-AnalyticsBasicTestSanity-88476517:ctest-vn22-70845716:ctest-vn22-70845716
2025-07-19 08:02:30,899 - DEBUG - Requesting: http://10.0.0.137:8083/Snh_IFMapTableShowReq?table_name=virtual-network&search_string=virtual-network:default-domain:ctest-AnalyticsBasicTestSanity-88476517:ctest-vn22-70845716
2025-07-19 08:02:30,916 - INFO - Validated that Routing instances and Config db in Control-nodes does not have VN ctest-vn22-70845716 info
2025-07-19 08:02:31,081 - ERROR - AssertionError
Python 3.6.8: /usr/bin/python3
Sat Jul 19 08:02:27 2025
A problem occurred in a Python script. Here is the sequence of
function calls leading up to the error, in the order they occurred.
/contrail-test/tcutils/wrappers.py in wrapper(self=, *args=(), **kwargs={})
78 log.info('Initial checks done. Running the testcase now')
79 log.info('')
80 result = function(self, *args, **kwargs)
81 if self.inputs.upgrade:
82 pid = os.getpid()
result = None
function =
self =
args = ()
kwargs = {}
/contrail-test/scripts/analytics/test_analytics_basic.py in test_verify_object_logs(self=)
56 trace_buffer_name='QeTraceBuf')
57 self.logger.debug("Status: %s"%(st))
58 assert res2, "Verification of %s failed"%msg
59
60 for i in range(2):
res2 = []
msg = 'ObjectVNTable for vn default-domain:ctest-Analyt...:ctest-vn22-70845716 on analytics node 10.0.0.137'
AssertionError: Verification of ObjectVNTable for vn default-domain:ctest-AnalyticsBasicTestSanity-88476517:ctest-vn22-70845716 on analytics node 10.0.0.137 failed
__cause__ = None
__class__ =
__context__ = None
__delattr__ =
__dict__ = {}
__dir__ =
__doc__ = 'Assertion failed.'
__eq__ =
__format__ =
__ge__ =
__getattribute__ =
__gt__ =
__hash__ =
__init__ =
__init_subclass__ =
__le__ =
__lt__ =
__ne__ =
__new__ =
__reduce__ =
__reduce_ex__ =
__repr__ =
__setattr__ =
__setstate__ =
__sizeof__ =
__str__ =
__subclasshook__ =
__suppress_context__ = False
__traceback__ =
args = ('Verification of ObjectVNTable for vn default-dom...vn22-70845716 on analytics node 10.0.0.137 failed',)
with_traceback =
The above is a description of an error in a Python program. Here is
the original traceback:
Traceback (most recent call last):
File "/contrail-test/tcutils/wrappers.py", line 80, in wrapper
result = function(self, *args, **kwargs)
File "/contrail-test/scripts/analytics/test_analytics_basic.py", line 58, in test_verify_object_logs
assert res2, "Verification of %s failed"%msg
AssertionError: Verification of ObjectVNTable for vn default-domain:ctest-AnalyticsBasicTestSanity-88476517:ctest-vn22-70845716 on analytics node 10.0.0.137 failed
2025-07-19 08:02:31,103 - DEBUG - No XMPP flaps were noticed during the test
2025-07-19 08:02:31,103 - INFO -
2025-07-19 08:02:31,104 - INFO - END TEST : test_verify_object_logs : FAILED[0:02:23]
2025-07-19 08:02:31,104 - INFO - --------------------------------------------------------------------------------
2025-07-19 08:02:31,962 - INFO - Deleted project: ctest-AnalyticsBasicTestSanity-88476517, ID : a778f4ac-ef1a-4900-bedb-829f6fbecf1d
2025-07-19 08:02:40,442 - DEBUG - Requesting: http://10.0.0.137:8083/Snh_IFMapTableShowReq?table_name=virtual-network&search_string=virtual-network:default-domain:ctest-FloatingipBasicTestSanity-76004662:ctest-fvn-53708898
2025-07-19 08:02:40,460 - DEBUG - Requesting: http://10.0.0.137:8083/Snh_ShowRoutingInstanceReq?name=default-domain:ctest-FloatingipBasicTestSanity-76004662:ctest-fvn-53708898:ctest-fvn-53708898
2025-07-19 08:02:42,701 - DEBUG - Requesting: http://10.0.0.137:8083/Snh_IFMapTableShowReq?table_name=virtual-network&search_string=virtual-network:default-domain:ctest-FloatingipBasicTestSanity-76004662:ctest-vn1-50957179
2025-07-19 08:02:42,720 - DEBUG - Requesting: http://10.0.0.137:8083/Snh_ShowRoutingInstanceReq?name=default-domain:ctest-FloatingipBasicTestSanity-76004662:ctest-vn1-50957179:ctest-vn1-50957179
2025-07-19 08:02:46,989 - DEBUG - Requesting: http://10.0.0.137:8083/Snh_IFMapTableShowReq?table_name=floating-ip-pool&search_string=floating-ip-pool:default-domain:ctest-FloatingipBasicTestSanity-76004662:ctest-fvn-53708898:ctest-some-pool-09448210
2025-07-19 08:03:05,941 - DEBUG - Requesting: http://10.0.0.137:8083/Snh_ShowRtGroupReq?x=target:64512:8000005
2025-07-19 08:03:09,887 - DEBUG - Requesting: http://10.0.0.137:8083/Snh_IFMapTableShowReq?table_name=floating-ip-pool&search_string=floating-ip-pool:default-domain:ctest-FloatingipBasicTestSanity-76004662:ctest-fvn-53708898:ctest-some-pool-09448210
2025-07-19 08:03:12,730 - DEBUG - Requesting: http://10.0.0.137:8083/Snh_ShowRoutingInstanceReq?name=default-domain:ctest-FloatingipBasicTestSanity-76004662:ctest-vn1-50957179:ctest-vn1-50957179
2025-07-19 08:03:12,749 - DEBUG - Requesting: http://10.0.0.137:8083/Snh_IFMapTableShowReq?table_name=virtual-network&search_string=virtual-network:default-domain:ctest-FloatingipBasicTestSanity-76004662:ctest-vn1-50957179
2025-07-19 08:03:13,179 - DEBUG - Requesting: http://10.0.0.137:8083/Snh_ShowRoutingInstanceReq?name=default-domain:ctest-FloatingipBasicTestSanity-76004662:ctest-fvn-53708898:ctest-fvn-53708898
2025-07-19 08:03:13,186 - DEBUG - Requesting: http://10.0.0.137:8083/Snh_IFMapTableShowReq?table_name=virtual-network&search_string=virtual-network:default-domain:ctest-FloatingipBasicTestSanity-76004662:ctest-fvn-53708898
2025-07-19 08:04:02,686 - DEBUG - Requesting: http://10.0.0.137:8083/Snh_IFMapTableShowReq?table_name=virtual-network&search_string=virtual-network:default-domain:ctest-TestBasicPolicyIpv4v6-21666874:ctest-vn-10233551
2025-07-19 08:04:02,704 - DEBUG - Requesting: http://10.0.0.137:8083/Snh_ShowRoutingInstanceReq?name=default-domain:ctest-TestBasicPolicyIpv4v6-21666874:ctest-vn-10233551:ctest-vn-10233551
2025-07-19 08:04:03,801 - DEBUG - Requesting: http://10.0.0.137:8083/Snh_IFMapTableShowReq?table_name=virtual-network&search_string=virtual-network:default-domain:ctest-TestBasicPolicyIpv4v6-21666874:ctest-vn-40764608
2025-07-19 08:04:03,817 - DEBUG - Requesting: http://10.0.0.137:8083/Snh_ShowRoutingInstanceReq?name=default-domain:ctest-TestBasicPolicyIpv4v6-21666874:ctest-vn-40764608:ctest-vn-40764608
2025-07-19 08:04:05,202 - DEBUG - Requesting: http://10.0.0.137:8083/Snh_ShowRoutingInstanceReq?name=default-domain:ctest-TestBasicPolicyIpv4v6-21666874:ctest-vn-40764608:ctest-vn-40764608
2025-07-19 08:04:05,209 - DEBUG - Requesting: http://10.0.0.137:8083/Snh_IFMapTableShowReq?table_name=virtual-network&search_string=virtual-network:default-domain:ctest-TestBasicPolicyIpv4v6-21666874:ctest-vn-40764608
2025-07-19 08:04:05,568 - DEBUG - Requesting: http://10.0.0.137:8083/Snh_ShowRoutingInstanceReq?name=default-domain:ctest-TestBasicPolicyIpv4v6-21666874:ctest-vn-10233551:ctest-vn-10233551
2025-07-19 08:04:05,579 - DEBUG - Requesting: http://10.0.0.137:8083/Snh_IFMapTableShowReq?table_name=virtual-network&search_string=virtual-network:default-domain:ctest-TestBasicPolicyIpv4v6-21666874:ctest-vn-10233551
2025-07-19 08:04:15,410 - DEBUG - Requesting: http://10.0.0.137:8083/Snh_IFMapTableShowReq?table_name=virtual-network&search_string=virtual-network:default-domain:ctest-TestBasicPolicy-28776157:ctest-vn-01297102
2025-07-19 08:04:15,435 - DEBUG - Requesting: http://10.0.0.137:8083/Snh_ShowRoutingInstanceReq?name=default-domain:ctest-TestBasicPolicy-28776157:ctest-vn-01297102:ctest-vn-01297102
2025-07-19 08:04:16,594 - DEBUG - Requesting: http://10.0.0.137:8083/Snh_IFMapTableShowReq?table_name=virtual-network&search_string=virtual-network:default-domain:ctest-TestBasicPolicy-28776157:ctest-vn-25550856
2025-07-19 08:04:16,613 - DEBUG - Requesting: http://10.0.0.137:8083/Snh_ShowRoutingInstanceReq?name=default-domain:ctest-TestBasicPolicy-28776157:ctest-vn-25550856:ctest-vn-25550856
2025-07-19 08:04:50,294 - DEBUG - Requesting: http://10.0.0.137:8083/Snh_ShowRoutingInstanceReq?name=default-domain:ctest-TestBasicPolicy-28776157:ctest-vn-25550856:ctest-vn-25550856
2025-07-19 08:04:50,309 - DEBUG - Requesting: http://10.0.0.137:8083/Snh_IFMapTableShowReq?table_name=virtual-network&search_string=virtual-network:default-domain:ctest-TestBasicPolicy-28776157:ctest-vn-25550856
2025-07-19 08:04:50,775 - DEBUG - Requesting: http://10.0.0.137:8083/Snh_ShowRoutingInstanceReq?name=default-domain:ctest-TestBasicPolicy-28776157:ctest-vn-01297102:ctest-vn-01297102
2025-07-19 08:04:50,787 - DEBUG - Requesting: http://10.0.0.137:8083/Snh_IFMapTableShowReq?table_name=virtual-network&search_string=virtual-network:default-domain:ctest-TestBasicPolicy-28776157:ctest-vn-01297102
2025-07-19 08:04:58,296 - DEBUG - Requesting: http://10.0.0.137:8083/Snh_IFMapTableShowReq?table_name=virtual-network&search_string=virtual-network:default-domain:ctest-TestSvcRegr-22557380:ctest-mgmt_vn-09170669
2025-07-19 08:04:58,312 - DEBUG - Requesting: http://10.0.0.137:8083/Snh_ShowRoutingInstanceReq?name=default-domain:ctest-TestSvcRegr-22557380:ctest-mgmt_vn-09170669:ctest-mgmt_vn-09170669
2025-07-19 08:05:00,500 - DEBUG - Requesting: http://10.0.0.137:8083/Snh_IFMapTableShowReq?table_name=virtual-network&search_string=virtual-network:default-domain:ctest-TestSvcRegr-22557380:ctest-left_vn-00236173
2025-07-19 08:05:00,515 - DEBUG - Requesting: http://10.0.0.137:8083/Snh_ShowRoutingInstanceReq?name=default-domain:ctest-TestSvcRegr-22557380:ctest-left_vn-00236173:ctest-left_vn-00236173
2025-07-19 08:05:08,101 - DEBUG - Requesting: http://10.0.0.137:8083/Snh_IFMapTableShowReq?table_name=virtual-network&search_string=virtual-network:default-domain:ctest-TestSvcRegr-22557380:ctest-right_vn-26629689
2025-07-19 08:05:08,114 - DEBUG - Requesting: http://10.0.0.137:8083/Snh_ShowRoutingInstanceReq?name=default-domain:ctest-TestSvcRegr-22557380:ctest-right_vn-26629689:ctest-right_vn-26629689
2025-07-19 08:06:39,160 - DEBUG - Requesting: http://10.0.0.137:8083/Snh_ShowRoutingInstanceReq?name=default-domain:ctest-TestSvcRegr-22557380:ctest-right_vn-26629689:ctest-right_vn-26629689
2025-07-19 08:06:39,177 - DEBUG - Requesting: http://10.0.0.137:8083/Snh_IFMapTableShowReq?table_name=virtual-network&search_string=virtual-network:default-domain:ctest-TestSvcRegr-22557380:ctest-right_vn-26629689
2025-07-19 08:06:39,641 - DEBUG - Requesting: http://10.0.0.137:8083/Snh_ShowRoutingInstanceReq?name=default-domain:ctest-TestSvcRegr-22557380:ctest-left_vn-00236173:ctest-left_vn-00236173
2025-07-19 08:06:39,651 - DEBUG - Requesting: http://10.0.0.137:8083/Snh_IFMapTableShowReq?table_name=virtual-network&search_string=virtual-network:default-domain:ctest-TestSvcRegr-22557380:ctest-left_vn-00236173
2025-07-19 08:06:40,123 - DEBUG - Requesting: http://10.0.0.137:8083/Snh_ShowRoutingInstanceReq?name=default-domain:ctest-TestSvcRegr-22557380:ctest-mgmt_vn-09170669:ctest-mgmt_vn-09170669
2025-07-19 08:06:40,140 - DEBUG - Requesting: http://10.0.0.137:8083/Snh_IFMapTableShowReq?table_name=virtual-network&search_string=virtual-network:default-domain:ctest-TestSvcRegr-22557380:ctest-mgmt_vn-09170669
2025-07-19 08:06:47,143 - DEBUG - Requesting: http://10.0.0.137:8083/Snh_IFMapTableShowReq?table_name=virtual-DNS&search_string=virtual-DNS:default-domain:ctest-vdns1-97682726
2025-07-19 08:07:39,472 - DEBUG - Requesting: http://10.0.0.137:8083/Snh_IFMapTableShowReq?table_name=virtual-DNS-record&search_string=virtual-DNS-record:default-domain:ctest-vdns1-97682726:test-rec
2025-07-19 08:07:48,194 - DEBUG - Requesting: http://10.0.0.137:8083/Snh_IFMapTableShowReq?table_name=virtual-DNS&search_string=virtual-DNS:default-domain:ctest-vdns1-97682726
2025-07-19 08:09:22,493 - DEBUG - Requesting: http://10.0.0.137:8083/Snh_IFMapTableShowReq?table_name=network-ipam&search_string=network-ipam:default-domain:ctest-TestBasicVMVN-87238771:ctest-ipam-02524490
2025-07-19 08:09:22,733 - DEBUG - Requesting: http://10.0.0.137:8083/Snh_IFMapTableShowReq?table_name=virtual-network&search_string=virtual-network:default-domain:ctest-TestBasicVMVN-87238771:ctest-vn-19838857
2025-07-19 08:09:22,739 - DEBUG - Requesting: http://10.0.0.137:8083/Snh_ShowRoutingInstanceReq?name=default-domain:ctest-TestBasicVMVN-87238771:ctest-vn-19838857:ctest-vn-19838857
2025-07-19 08:09:57,070 - DEBUG - Requesting: http://10.0.0.137:8083/Snh_ShowRoutingInstanceReq?name=default-domain:ctest-TestBasicVMVN-87238771:ctest-vn-19838857:ctest-vn-19838857
2025-07-19 08:09:57,083 - DEBUG - Requesting: http://10.0.0.137:8083/Snh_IFMapTableShowReq?table_name=virtual-network&search_string=virtual-network:default-domain:ctest-TestBasicVMVN-87238771:ctest-vn-19838857
2025-07-19 08:09:57,218 - DEBUG - Requesting: http://10.0.0.137:8083/Snh_ShowRoutingInstanceReq?name=default-domain:ctest-TestBasicVMVN-87238771:ctest-ipam-02524490:ctest-ipam-02524490
2025-07-19 08:09:57,232 - DEBUG - Requesting: http://10.0.0.137:8083/Snh_IFMapTableShowReq?table_name=network-ipam&search_string=network-ipam:default-domain:ctest-TestBasicVMVN-87238771:ctest-ipam-02524490