| Name | Status | Type | Time(s) | LogFile |
| test_contrail_status[cb_sanity,ci_sanity,dev_sanity_dpdk,sanity] | Success | | 0.595 | |
| test_verify_object_logs[ci_sanity,dev_sanity_dpdk,sanity,suite1] | Success | | 47.021 | |
| test_db_manage[cb_sanity,ci_sanity,dev_sanity_dpdk,sanity] | Success | | 4.137 | |
| test_analytics_docs[cb_sanity,ci_sanity,dev_sanity_dpdk,sanity] | Success | | 0.312 | |
| test_config_docs[cb_sanity,ci_sanity,dev_sanity_dpdk,sanity] | Success | | 0.344 | |
| test_floating_ip[cb_sanity,ci_contrail_go_kolla_ocata_sanity,ci_sanity,quick_sanity,sanity,suite1,vrouter_gw] | Success | | 103.343 | |
| test_heat_stacks_list[cb_sanity,ci_contrail_go_kolla_ocata_sanity,ci_sanity] | Success | | 1.197 | |
| test_network_tags_crud[ci_sanity,sanity] | Failure | Details
Traceback (most recent call last):
testtools.testresult.real._StringException: Traceback (most recent call last):
File "/contrail-test/tcutils/wrappers.py", line 176, in wrapper
raise TestFailed("\n ".join(errmsg))
tcutils.cores.TestFailed: Test failed: InternalServerError
Python 3.9.25: /usr/bin/python3
Wed Oct 21 16:40:15 2026
A problem occurred in a Python script. Here is the sequence of
function calls leading up to the error, in the order they occurred.
/contrail-test/tcutils/wrappers.py in wrapper(self=<scripts.neutron.test_crud.TestCRUD.test_network_tags_crud[ci_sanity,sanity] id=0x7fb0049e4e50>, *args=(), **kwargs={})
78 log.info('Initial checks done. Running the testcase now')
79 log.info('')
80 result = function(self, *args, **kwargs)
81 if self.inputs.upgrade:
82 pid = os.getpid()
result = None
function = <function TestCRUD.test_network_tags_crud>
self = <scripts.neutron.test_crud.TestCRUD.test_network_tags_crud[ci_sanity,sanity] id=0x7fb0049e4e50>
args = ()
kwargs = {}
/contrail-test/scripts/neutron/test_crud.py in test_network_tags_crud(self=<scripts.neutron.test_crud.TestCRUD.test_network_tags_crud[ci_sanity,sanity] id=0x7fb0049e4e50>)
605
606 # append: single PUT must add, not wipe the set
607 c.add_tag('networks', net_id, 'c')
608 assert tags() == {'a', 'b', 'c'}, 'add_tag replaced the set'
609
c = <neutronclient.v2_0.client.Client object>
c.add_tag = <bound method Client.add_tag of <neutronclient.v2_0.client.Client object>>
net_id = '6e04f5f3-3ff4-4244-b77e-4fa92a7dcd62'
/usr/local/lib/python3.9/site-packages/neutronclient/v2_0/client.py in add_tag(self=<neutronclient.v2_0.client.Client object>, resource_type='networks', resource_id='6e04f5f3-3ff4-4244-b77e-4fa92a7dcd62', tag='c', **_params={})
2092 def add_tag(self, resource_type, resource_id, tag, **_params):
2093 """Add a tag on the resource."""
2094 return self.put(self.tag_path % (resource_type, resource_id, tag))
2095
2096 def replace_tag(self, resource_type, resource_id, body, **_params):
self = <neutronclient.v2_0.client.Client object>
self.put = <bound method ClientBase.put of <neutronclient.v2_0.client.Client object>>
self.tag_path = '/%s/%s/tags/%s'
resource_type = 'networks'
resource_id = '6e04f5f3-3ff4-4244-b77e-4fa92a7dcd62'
tag = 'c'
/usr/local/lib/python3.9/site-packages/neutronclient/v2_0/client.py in put(self=<neutronclient.v2_0.client.Client object>, action='/networks/6e04f5f3-3ff4-4244-b77e-4fa92a7dcd62/tags/c', body=None, headers=None, params=None)
360
361 def put(self, action, body=None, headers=None, params=None):
362 return self.retry_request("PUT", action, body=body,
363 headers=headers, params=params)
364
self = <neutronclient.v2_0.client.Client object>
self.retry_request = <bound method ClientBase.retry_request of <neutronclient.v2_0.client.Client object>>
action = '/networks/6e04f5f3-3ff4-4244-b77e-4fa92a7dcd62/tags/c'
body = None
headers = None
params = None
/usr/local/lib/python3.9/site-packages/neutronclient/v2_0/client.py in retry_request(self=<neutronclient.v2_0.client.Client object>, method='PUT', action='/networks/6e04f5f3-3ff4-4244-b77e-4fa92a7dcd62/tags/c', body=None, headers=None, params=None)
328 for i in range(max_attempts):
329 try:
330 return self.do_request(method, action, body=body,
331 headers=headers, params=params)
332 except (exceptions.ConnectionFailed, ksa_exc.ConnectionError):
self = <neutronclient.v2_0.client.Client object>
self.do_request = <bound method ClientBase.do_request of <neutronclient.v2_0.client.Client object>>
method = 'PUT'
action = '/networks/6e04f5f3-3ff4-4244-b77e-4fa92a7dcd62/tags/c'
body = None
headers = None
params = None
/usr/local/lib/python3.9/site-packages/neutronclient/v2_0/client.py in do_request(self=<neutronclient.v2_0.client.Client object>, method='PUT', action='/v2.0/networks/6e04f5f3-3ff4-4244-b77e-4fa92a7dcd62/tags/c', body=None, headers=None, params=None)
292 if not replybody:
293 replybody = resp.reason
294 self._handle_fault_response(status_code, replybody, resp)
295
296 def get_auth_info(self):
self = <neutronclient.v2_0.client.Client object>
self._handle_fault_response = <bound method ClientBase._handle_fault_response of <neutronclient.v2_0.client.Client object>>
status_code = 500
replybody = '{"NeutronError": {"type": "HTTPInternalServerErr...r while processing your request.", "detail": ""}}'
resp = <Response [500]>
/usr/local/lib/python3.9/site-packages/neutronclient/v2_0/client.py in _handle_fault_response(self=<neutronclient.v2_0.client.Client object>, status_code=500, response_body='{"NeutronError": {"type": "HTTPInternalServerErr...r while processing your request.", "detail": ""}}', resp=<Response [500]>)
267 error_body = self._convert_into_with_meta(des_error_body, resp)
268 # Raise the appropriate exception
269 exception_handler_v20(status_code, error_body)
270
271 def do_request(self, method, action, body=None, headers=None, params=None):
global exception_handler_v20 = <function exception_handler_v20>
status_code = 500
error_body = {'NeutronError': {'type': 'HTTPInternalServerErr...r while processing your request.', 'detail': ''}}
/usr/local/lib/python3.9/site-packages/neutronclient/v2_0/client.py in exception_handler_v20(status_code=500, error_content={'NeutronError': {'type': 'HTTPInternalServerErr...r while processing your request.', 'detail': ''}})
89 client_exc = exceptions.NeutronClientException
90
91 raise client_exc(message=error_message,
92 status_code=status_code,
93 request_ids=request_ids)
client_exc = <class 'neutronclient.common.exceptions.InternalServerError'>
message undefined
error_message = 'Request Failed: internal server error while processing your request.'
status_code = 500
request_ids = ['req-bd729a25-5df9-4619-9f9c-e6621f2f5d40']
InternalServerError: Request Failed: internal server error while processing your request.
Neutron server returns request_ids: ['req-bd729a25-5df9-4619-9f9c-e6621f2f5d40']
__cause__ = None
__class__ = <class 'neutronclient.common.exceptions.InternalServerError'>
__context__ = None
__delattr__ = <method-wrapper '__delattr__' of InternalServerError object>
__dict__ = {'_error_string': "Request Failed: internal server error while proc...ids: ['req-bd729a25-5df9-4619-9f9c-e6621f2f5d40']", 'message': "Request Failed: internal server error while proc...ids: ['req-bd729a25-5df9-4619-9f9c-e6621f2f5d40']", 'request_ids': ['req-bd729a25-5df9-4619-9f9c-e6621f2f5d40'], 'status_code': 500}
__dir__ = <built-in method __dir__ of InternalServerError object>
__doc__ = None
__eq__ = <method-wrapper '__eq__' of InternalServerError object>
__format__ = <built-in method __format__ of InternalServerError object>
__ge__ = <method-wrapper '__ge__' of InternalServerError object>
__getattribute__ = <method-wrapper '__getattribute__' of InternalServerError object>
__gt__ = <method-wrapper '__gt__' of InternalServerError object>
__hash__ = <method-wrapper '__hash__' of InternalServerError object>
__init__ = <bound method NeutronClientException.__init__ of InternalServerError()>
__init_subclass__ = <built-in method __init_subclass__ of type object>
__le__ = <method-wrapper '__le__' of InternalServerError object>
__lt__ = <method-wrapper '__lt__' of InternalServerError object>
__module__ = 'neutronclient.common.exceptions'
__ne__ = <method-wrapper '__ne__' of InternalServerError object>
__new__ = <built-in method __new__ of type object>
__reduce__ = <built-in method __reduce__ of InternalServerError object>
__reduce_ex__ = <built-in method __reduce_ex__ of InternalServerError object>
__repr__ = <method-wrapper '__repr__' of InternalServerError object>
__setattr__ = <method-wrapper '__setattr__' of InternalServerError object>
__setstate__ = <built-in method __setstate__ of InternalServerError object>
__sizeof__ = <built-in method __sizeof__ of InternalServerError object>
__str__ = <bound method NeutronException.__str__ of InternalServerError()>
__subclasshook__ = <built-in method __subclasshook__ of type object>
__suppress_context__ = False
__traceback__ = <traceback object>
__weakref__ = None
_error_string = "Request Failed: internal server error while proc...ids: ['req-bd729a25-5df9-4619-9f9c-e6621f2f5d40']"
args = ()
message = "Request Failed: internal server error while proc...ids: ['req-bd729a25-5df9-4619-9f9c-e6621f2f5d40']"
req_ids_msg = 'Neutron server returns request_ids: %s'
request_ids = ['req-bd729a25-5df9-4619-9f9c-e6621f2f5d40']
status_code = 500
with_traceback = <built-in method with_traceback of InternalServerError object>
The above is a description of an error in a Python program. Here is
the original traceback:
Traceback (most recent call last):
File "/contrail-test/tcutils/wrappers.py", line 80, in wrapper
result = function(self, *args, **kwargs)
File "/contrail-test/scripts/neutron/test_crud.py", line 607, in test_network_tags_crud
c.add_tag('networks', net_id, 'c')
File "/usr/local/lib/python3.9/site-packages/neutronclient/v2_0/client.py", line 2094, in add_tag
return self.put(self.tag_path % (resource_type, resource_id, tag))
File "/usr/local/lib/python3.9/site-packages/neutronclient/v2_0/client.py", line 362, in put
return self.retry_request("PUT", action, body=body,
File "/usr/local/lib/python3.9/site-packages/neutronclient/v2_0/client.py", line 330, in retry_request
return self.do_request(method, action, body=body,
File "/usr/local/lib/python3.9/site-packages/neutronclient/v2_0/client.py", line 294, in do_request
self._handle_fault_response(status_code, replybody, resp)
File "/usr/local/lib/python3.9/site-packages/neutronclient/v2_0/client.py", line 269, in _handle_fault_response
exception_handler_v20(status_code, error_body)
File "/usr/local/lib/python3.9/site-packages/neutronclient/v2_0/client.py", line 91, in exception_handler_v20
raise client_exc(message=error_message,
neutronclient.common.exceptions.InternalServerError: Request Failed: internal server error while processing your request.
Neutron server returns request_ids: ['req-bd729a25-5df9-4619-9f9c-e6621f2f5d40']
| 5.471 |
Log File
|
| test_router_crud[ci_sanity,dev_sanity_dpdk,sanity] | Success | | 6.375 | |
| test_ports_bindings[ci_sanity,dev_sanity_dpdk,sanity] | Success | | 2.730 | |
| test_ports_specific_subnet_ip[ci_sanity,dev_sanity_dpdk,sanity] | Success | | 103.131 | |
| test_basic_router_behavior[ci_sanity,dev_sanity_dpdk,sanity] | Success | | 118.377 | |
| test_basic_snat_behavior_without_external_connectivity[ci_sanity,dev_sanity_dpdk,sanity,suite1] | Success | | 102.814 | |
| test_basic_policy_allow_deny[cb_sanity,ci_contrail_go_kolla_ocata_sanity,ci_sanity,quick_sanity,sanity,suite1] | Skipped | Disabling v6 tests for CI | 6.192 | |
| test_remove_policy_with_ref[ci_sanity,sanity] | Success | | 4.903 | |
| test_basic_policy_allow_deny[cb_sanity,ci_contrail_go_kolla_ocata_sanity,ci_sanity,quick_sanity,sanity,suite1] | Success | | 113.346 | |
| test_rp_interface[ci_sanity,sanity] | Success | | 103.672 | |
| test_svc_in_network_datapath[ci_sanity] | Success | | 132.764 | |
| test_vdns_ping_same_vn[ci_sanity,sanity,suite1] | Success | | 180.872 | |
| test_vm_file_trf_scp_tests[ci_contrail_go_kolla_ocata_sanity,ci_sanity,quick_sanity,vrouter_gw] | Success | | 101.761 | |
| test_generic_link_local_service[cb_sanity,ci_contrail_go_kolla_ocata_sanity,ci_sanity,dev_sanity_dpdk,sanity,suite1] | Success | | 83.483 | |
| test_metadata_service[cb_sanity,ci_sanity,sanity,suite1] | Failure | Details
Traceback (most recent call last):
testtools.testresult.real._StringException: stderr: {{{
Warning: run() received nonzero return code 1 while executing 'cat /tmp/output.txt'!
Warning: run() received nonzero return code 1 while executing 'cat /tmp/output.txt'!
Warning: run() received nonzero return code 1 while executing 'cat /tmp/output.txt'!
Warning: run() received nonzero return code 1 while executing 'cat /tmp/output.txt'!
Warning: run() received nonzero return code 1 while executing 'cat /tmp/output.txt'!
Warning: run() received nonzero return code 1 while executing 'cat /tmp/output.txt'!
Warning: run() received nonzero return code 1 while executing 'cat /tmp/output.txt'!
Warning: run() received nonzero return code 1 while executing 'cat /tmp/output.txt'!
Warning: run() received nonzero return code 1 while executing 'cat /tmp/output.txt'!
Warning: run() received nonzero return code 1 while executing 'cat /tmp/output.txt'!
}}}
stdout: {{{
[cirros@169.254.0.3] run: cat /tmp/output.txt
[cirros@169.254.0.3] run: cat /tmp/output.txt
[cirros@169.254.0.3] out: cat: can't open '/tmp/output.txt': No such file or directory
[cirros@169.254.0.3] out:
[cirros@169.254.0.3] run: cat /tmp/output.txt
[cirros@169.254.0.3] out: cat: can't open '/tmp/output.txt': No such file or directory
[cirros@169.254.0.3] out:
[cirros@169.254.0.3] run: cat /tmp/output.txt
[cirros@169.254.0.3] out: cat: can't open '/tmp/output.txt': No such file or directory
[cirros@169.254.0.3] out:
[cirros@169.254.0.3] run: cat /tmp/output.txt
[cirros@169.254.0.3] out: cat: can't open '/tmp/output.txt': No such file or directory
[cirros@169.254.0.3] out:
[cirros@169.254.0.3] run: cat /tmp/output.txt
[cirros@169.254.0.3] out: cat: can't open '/tmp/output.txt': No such file or directory
[cirros@169.254.0.3] out:
[cirros@169.254.0.3] run: cat /tmp/output.txt
[cirros@169.254.0.3] out: cat: can't open '/tmp/output.txt': No such file or directory
[cirros@169.254.0.3] out:
[cirros@169.254.0.3] run: cat /tmp/output.txt
[cirros@169.254.0.3] out: cat: can't open '/tmp/output.txt': No such file or directory
[cirros@169.254.0.3] out:
[cirros@169.254.0.3] run: cat /tmp/output.txt
[cirros@169.254.0.3] out: cat: can't open '/tmp/output.txt': No such file or directory
[cirros@169.254.0.3] out:
[cirros@169.254.0.3] run: cat /tmp/output.txt
[cirros@169.254.0.3] out: cat: can't open '/tmp/output.txt': No such file or directory
[cirros@169.254.0.3] out:
[cirros@169.254.0.3] run: cat /tmp/output.txt
[cirros@169.254.0.3] out: cat: can't open '/tmp/output.txt': No such file or directory
[cirros@169.254.0.3] out:
}}}
Traceback (most recent call last):
File "/contrail-test/tcutils/wrappers.py", line 176, in wrapper
raise TestFailed("\n ".join(errmsg))
tcutils.cores.TestFailed: Test failed: AssertionError
Python 3.9.25: /usr/bin/python3
Wed Oct 21 17:00:18 2026
A problem occurred in a Python script. Here is the sequence of
function calls leading up to the error, in the order they occurred.
/contrail-test/tcutils/wrappers.py in wrapper(self=<scripts.vm_regression.test_vm_basic.TestBasicVM...anity,ci_sanity,sanity,suite1] id=0x7fb0045c4c10>, *args=(), **kwargs={})
78 log.info('Initial checks done. Running the testcase now')
79 log.info('')
80 result = function(self, *args, **kwargs)
81 if self.inputs.upgrade:
82 pid = os.getpid()
result = None
function = <function TestBasicVMVN.test_metadata_service>
self = <scripts.vm_regression.test_vm_basic.TestBasicVM...anity,ci_sanity,sanity,suite1] id=0x7fb0045c4c10>
args = ()
kwargs = {}
/contrail-test/scripts/vm_regression/test_vm_basic.py in test_metadata_service(self=<scripts.vm_regression.test_vm_basic.TestBasicVM...anity,ci_sanity,sanity,suite1] id=0x7fb0045c4c10>)
69 if i+1 < mtries:
70 time.sleep(2)
71 assert result
72
73 @test.attr(type=['suite1'])
result = False
AssertionError:
__cause__ = None
__class__ = <class 'AssertionError'>
__context__ = None
__delattr__ = <method-wrapper '__delattr__' of AssertionError object>
__dict__ = {}
__dir__ = <built-in method __dir__ of AssertionError object>
__doc__ = 'Assertion failed.'
__eq__ = <method-wrapper '__eq__' of AssertionError object>
__format__ = <built-in method __format__ of AssertionError object>
__ge__ = <method-wrapper '__ge__' of AssertionError object>
__getattribute__ = <method-wrapper '__getattribute__' of AssertionError object>
__gt__ = <method-wrapper '__gt__' of AssertionError object>
__hash__ = <method-wrapper '__hash__' of AssertionError object>
__init__ = <method-wrapper '__init__' of AssertionError object>
__init_subclass__ = <built-in method __init_subclass__ of type object>
__le__ = <method-wrapper '__le__' of AssertionError object>
__lt__ = <method-wrapper '__lt__' of AssertionError object>
__ne__ = <method-wrapper '__ne__' of AssertionError object>
__new__ = <built-in method __new__ of type object>
__reduce__ = <built-in method __reduce__ of AssertionError object>
__reduce_ex__ = <built-in method __reduce_ex__ of AssertionError object>
__repr__ = <method-wrapper '__repr__' of AssertionError object>
__setattr__ = <method-wrapper '__setattr__' of AssertionError object>
__setstate__ = <built-in method __setstate__ of AssertionError object>
__sizeof__ = <built-in method __sizeof__ of AssertionError object>
__str__ = <method-wrapper '__str__' of AssertionError object>
__subclasshook__ = <built-in method __subclasshook__ of type object>
__suppress_context__ = False
__traceback__ = <traceback object>
args = ()
with_traceback = <built-in method with_traceback of AssertionError object>
The above is a description of an error in a Python program. Here is
the original traceback:
Traceback (most recent call last):
File "/contrail-test/tcutils/wrappers.py", line 80, in wrapper
result = function(self, *args, **kwargs)
File "/contrail-test/scripts/vm_regression/test_vm_basic.py", line 71, in test_metadata_service
assert result
AssertionError
| 104.919 |
Log File
|
| test_ping_within_vn_two_vms_two_different_subnets[ci_contrail_go_kolla_ocata_sanity,ci_sanity,sanity,suite1] | Success | | 134.234 | |