2026-10-21 12:14:16,663 - INFO - Domain Default found not creating
2026-10-21 12:14:16,866 - INFO - Project ctest-TestBasicVMVN-78270578 not found, creating it
2026-10-21 12:14:17,360 - INFO - Created Project:ctest-TestBasicVMVN-78270578, ID : e7ffd15f-3ac9-488a-93cf-43bc1a974a74
2026-10-21 12:14:19,131 - INFO - ================================================================================
2026-10-21 12:14:19,131 - INFO - STARTING TEST : test_generic_link_local_service
2026-10-21 12:14:19,132 - INFO - TEST DESCRIPTION :
Description: Test to validate generic linklocal service - running nova list from vm.
1.Create generic link local service to be able to wget to jenkins
2.Create a vm
3.Try wget to jenkins - passes if successful else fails
Maintainer: sandipd@juniper.net
2026-10-21 12:14:19,393 - DEBUG - Nothing to compare xmpp stats {'10.0.0.185': {'10.20.0.17': '0'}} with
2026-10-21 12:14:19,393 - INFO - Initial checks done. Running the testcase now
2026-10-21 12:14:19,393 - INFO -
2026-10-21 12:14:20,025 - DEBUG - Response for create_network : {'network': {'id': '0f7fb98e-f2f2-4877-9569-ef2e98c57310', 'name': 'ctest-vn2_metadata-41879943', 'tenant_id': 'e7ffd15f3ac9488a93cf43bc1a974a74', 'project_id': 'e7ffd15f3ac9488a93cf43bc1a974a74', 'admin_state_up': True, 'shared': False, 'status': 'ACTIVE', 'router:external': False, 'mtu': 0, 'tags': [], 'subnets': [], 'fq_name': ['default-domain', 'ctest-TestBasicVMVN-78270578', 'ctest-vn2_metadata-41879943'], 'port_security_enabled': True, 'description': ''}}
2026-10-21 12:14:20,201 - DEBUG - Response for create_subnet : {'subnet': {'id': 'd2a5b998-0cf8-4b70-9e9e-561450585d4c', 'name': '', 'tenant_id': 'e7ffd15f3ac9488a93cf43bc1a974a74', 'network_id': '0f7fb98e-f2f2-4877-9569-ef2e98c57310', 'ip_version': 4, 'cidr': '11.1.1.0/24', 'allocation_pools': [{'start': '11.1.1.2', 'end': '11.1.1.254'}], 'gateway_ip': '11.1.1.1', 'enable_dhcp': True, 'ipv6_ra_mode': None, 'ipv6_address_mode': None, 'dns_nameservers': [], 'host_routes': [], 'dns_server_address': '11.1.1.2', 'tags': [], 'project_id': 'e7ffd15f3ac9488a93cf43bc1a974a74'}}
2026-10-21 12:14:20,219 - INFO - Created VN ctest-vn2_metadata-41879943
2026-10-21 12:14:20,273 - DEBUG - VN ctest-vn2_metadata-41879943 UUID is 0f7fb98e-f2f2-4877-9569-ef2e98c57310
2026-10-21 12:14:20,456 - DEBUG - Services list from nova: [, , ]
2026-10-21 12:14:20,828 - INFO - VM ([]) created on node: (cn-jenkins-deploy-platform-ansible-os-6377-1), Zone: (nova:cn-jenkins-deploy-platform-ansible-os-6377-1)
2026-10-21 12:14:20,937 - DEBUG - Link local service introspect added
2026-10-21 12:14:20,981 - DEBUG - VM is still in BUILD state, Expected: ACTIVE
2026-10-21 12:14:26,095 - DEBUG - VM is still in BUILD state, Expected: ACTIVE
2026-10-21 12:14:31,185 - DEBUG - VM is still in BUILD state, Expected: ACTIVE
2026-10-21 12:14:36,283 - DEBUG - VM is still in BUILD state, Expected: ACTIVE
2026-10-21 12:14:41,465 - DEBUG - VM is still in BUILD state, Expected: ACTIVE
2026-10-21 12:14:46,549 - DEBUG - VM is still in BUILD state, Expected: ACTIVE
2026-10-21 12:14:51,639 - DEBUG - VM is in ACTIVE state now
2026-10-21 12:14:51,784 - INFO - Waiting for VM ctest-TestBasicVMVN-78270578-64530813 to be up..
2026-10-21 12:14:51,784 - INFO - VM name : ctest-TestBasicVMVN-78270578-64530813
2026-10-21 12:14:51,867 - DEBUG - VM ctest-TestBasicVMVN-78270578-64530813 ID is a0d387a7-1174-4cdc-a238-c40962baf10c
2026-10-21 12:14:51,867 - DEBUG - VM ctest-TestBasicVMVN-78270578-64530813 launched on Node cn-jenkins-deploy-platform-ansible-os-6377-1
2026-10-21 12:14:51,950 - DEBUG - Requesting: http://10.0.0.185:8082/virtual-machine/a0d387a7-1174-4cdc-a238-c40962baf10c
2026-10-21 12:14:52,323 - DEBUG - Requesting: http://10.0.0.185:8082/virtual-machine/a0d387a7-1174-4cdc-a238-c40962baf10c
2026-10-21 12:14:52,355 - DEBUG - Requesting: http://10.0.0.185:8082/virtual-machine-interface/1f5f469a-bfc9-4595-b5b4-cc441458219b
2026-10-21 12:14:55,636 - DEBUG - (True, 'PING 169.254.0.3 (169.254.0.3) 56(84) bytes of data.\r\n64 bytes from 169.254.0.3: icmp_seq=2 ttl=63 time=4.43 ms\r\n\r\n--- 169.254.0.3 ping statistics ---\r\n2 packets transmitted, 1 received, 50% packet loss, time 1028ms\r\nrtt min/avg/max/mdev = 4.431/4.431/4.431/0.000 ms')
2026-10-21 12:14:55,636 - INFO - Ping to Metadata IP 169.254.0.3 of VM ctest-TestBasicVMVN-78270578-64530813 passed
2026-10-21 12:14:55,797 - DEBUG - verify_vm_launched is skipped since self.vm_launch_flag is set
2026-10-21 12:14:55,797 - DEBUG - Waiting to SSH to VM ctest-TestBasicVMVN-78270578-64530813, IP 11.1.1.3, Port 22
2026-10-21 12:14:55,863 - DEBUG - Error on ssh to cirros@169.254.0.3:22, result: /bin/bash: connect: Connection refused
/bin/bash: line 1: /dev/tcp/169.254.0.3/22: Connection refused {'failed': True, 'command': '(echo > /dev/tcp/169.254.0.3/22)', 'real_command': '/bin/bash -l -c "(echo > /dev/tcp/169.254.0.3/22)"', 'return_code': 1, 'succeeded': False, 'stderr': ''}
2026-10-21 12:14:55,946 - DEBUG - VM ctest-TestBasicVMVN-78270578-64530813 is NOT ready for SSH connections, VM status: ACTIVE
2026-10-21 12:15:00,948 - DEBUG - verify_vm_launched is skipped since self.vm_launch_flag is set
2026-10-21 12:15:00,948 - DEBUG - Waiting to SSH to VM ctest-TestBasicVMVN-78270578-64530813, IP 11.1.1.3, Port 22
2026-10-21 12:15:01,015 - DEBUG - Error on ssh to cirros@169.254.0.3:22, result: /bin/bash: connect: Connection refused
/bin/bash: line 1: /dev/tcp/169.254.0.3/22: Connection refused {'failed': True, 'command': '(echo > /dev/tcp/169.254.0.3/22)', 'real_command': '/bin/bash -l -c "(echo > /dev/tcp/169.254.0.3/22)"', 'return_code': 1, 'succeeded': False, 'stderr': ''}
2026-10-21 12:15:01,111 - DEBUG - VM ctest-TestBasicVMVN-78270578-64530813 is NOT ready for SSH connections, VM status: ACTIVE
2026-10-21 12:15:06,112 - DEBUG - verify_vm_launched is skipped since self.vm_launch_flag is set
2026-10-21 12:15:06,112 - DEBUG - Waiting to SSH to VM ctest-TestBasicVMVN-78270578-64530813, IP 11.1.1.3, Port 22
2026-10-21 12:15:06,179 - DEBUG - Error on ssh to cirros@169.254.0.3:22, result: /bin/bash: connect: Connection refused
/bin/bash: line 1: /dev/tcp/169.254.0.3/22: Connection refused {'failed': True, 'command': '(echo > /dev/tcp/169.254.0.3/22)', 'real_command': '/bin/bash -l -c "(echo > /dev/tcp/169.254.0.3/22)"', 'return_code': 1, 'succeeded': False, 'stderr': ''}
2026-10-21 12:15:06,272 - DEBUG - VM ctest-TestBasicVMVN-78270578-64530813 is NOT ready for SSH connections, VM status: ACTIVE
2026-10-21 12:15:11,274 - DEBUG - verify_vm_launched is skipped since self.vm_launch_flag is set
2026-10-21 12:15:11,274 - DEBUG - Waiting to SSH to VM ctest-TestBasicVMVN-78270578-64530813, IP 11.1.1.3, Port 22
2026-10-21 12:15:11,344 - DEBUG - Error on ssh to cirros@169.254.0.3:22, result: /bin/bash: connect: Connection refused
/bin/bash: line 1: /dev/tcp/169.254.0.3/22: Connection refused {'failed': True, 'command': '(echo > /dev/tcp/169.254.0.3/22)', 'real_command': '/bin/bash -l -c "(echo > /dev/tcp/169.254.0.3/22)"', 'return_code': 1, 'succeeded': False, 'stderr': ''}
2026-10-21 12:15:11,435 - DEBUG - VM ctest-TestBasicVMVN-78270578-64530813 is NOT ready for SSH connections, VM status: ACTIVE
2026-10-21 12:15:16,436 - DEBUG - verify_vm_launched is skipped since self.vm_launch_flag is set
2026-10-21 12:15:16,436 - DEBUG - Waiting to SSH to VM ctest-TestBasicVMVN-78270578-64530813, IP 11.1.1.3, Port 22
2026-10-21 12:15:16,503 - DEBUG - Error on ssh to cirros@169.254.0.3:22, result: /bin/bash: connect: Connection refused
/bin/bash: line 1: /dev/tcp/169.254.0.3/22: Connection refused {'failed': True, 'command': '(echo > /dev/tcp/169.254.0.3/22)', 'real_command': '/bin/bash -l -c "(echo > /dev/tcp/169.254.0.3/22)"', 'return_code': 1, 'succeeded': False, 'stderr': ''}
2026-10-21 12:15:16,590 - DEBUG - VM ctest-TestBasicVMVN-78270578-64530813 is NOT ready for SSH connections, VM status: ACTIVE
2026-10-21 12:15:21,591 - DEBUG - verify_vm_launched is skipped since self.vm_launch_flag is set
2026-10-21 12:15:21,591 - DEBUG - Waiting to SSH to VM ctest-TestBasicVMVN-78270578-64530813, IP 11.1.1.3, Port 22
2026-10-21 12:15:21,660 - DEBUG - Error on ssh to cirros@169.254.0.3:22, result: /bin/bash: connect: Connection refused
/bin/bash: line 1: /dev/tcp/169.254.0.3/22: Connection refused {'failed': True, 'command': '(echo > /dev/tcp/169.254.0.3/22)', 'real_command': '/bin/bash -l -c "(echo > /dev/tcp/169.254.0.3/22)"', 'return_code': 1, 'succeeded': False, 'stderr': ''}
2026-10-21 12:15:21,743 - DEBUG - VM ctest-TestBasicVMVN-78270578-64530813 is NOT ready for SSH connections, VM status: ACTIVE
2026-10-21 12:15:26,744 - DEBUG - verify_vm_launched is skipped since self.vm_launch_flag is set
2026-10-21 12:15:26,744 - DEBUG - Waiting to SSH to VM ctest-TestBasicVMVN-78270578-64530813, IP 11.1.1.3, Port 22
2026-10-21 12:15:26,811 - DEBUG - Error on ssh to cirros@169.254.0.3:22, result: /bin/bash: connect: Connection refused
/bin/bash: line 1: /dev/tcp/169.254.0.3/22: Connection refused {'failed': True, 'command': '(echo > /dev/tcp/169.254.0.3/22)', 'real_command': '/bin/bash -l -c "(echo > /dev/tcp/169.254.0.3/22)"', 'return_code': 1, 'succeeded': False, 'stderr': ''}
2026-10-21 12:15:26,900 - DEBUG - VM ctest-TestBasicVMVN-78270578-64530813 is NOT ready for SSH connections, VM status: ACTIVE
2026-10-21 12:15:31,900 - DEBUG - verify_vm_launched is skipped since self.vm_launch_flag is set
2026-10-21 12:15:31,900 - DEBUG - Waiting to SSH to VM ctest-TestBasicVMVN-78270578-64530813, IP 11.1.1.3, Port 22
2026-10-21 12:15:31,968 - DEBUG - Error on ssh to cirros@169.254.0.3:22, result: /bin/bash: connect: Connection refused
/bin/bash: line 1: /dev/tcp/169.254.0.3/22: Connection refused {'failed': True, 'command': '(echo > /dev/tcp/169.254.0.3/22)', 'real_command': '/bin/bash -l -c "(echo > /dev/tcp/169.254.0.3/22)"', 'return_code': 1, 'succeeded': False, 'stderr': ''}
2026-10-21 12:15:32,055 - DEBUG - VM ctest-TestBasicVMVN-78270578-64530813 is NOT ready for SSH connections, VM status: ACTIVE
2026-10-21 12:15:37,056 - DEBUG - verify_vm_launched is skipped since self.vm_launch_flag is set
2026-10-21 12:15:37,056 - DEBUG - Waiting to SSH to VM ctest-TestBasicVMVN-78270578-64530813, IP 11.1.1.3, Port 22
2026-10-21 12:15:37,223 - DEBUG - VM ctest-TestBasicVMVN-78270578-64530813 is ready for SSH connections
2026-10-21 12:15:37,224 - INFO - Retry 0
2026-10-21 12:15:37,224 - DEBUG - Running remote_cmd, Cmd : wget http://169.254.1.2:8083 --spider && echo "Successful", host_string: cirros@169.254.0.3, password: cubswin:)gateway: ubuntu@10.0.0.185, gateway password: c0ntrail123
2026-10-21 12:15:37,224 - DEBUG - wget http://169.254.1.2:8083 --spider && echo "Successful"
2026-10-21 12:15:39,295 - DEBUG - Connecting to 169.254.1.2:8083 (169.254.1.2:8083)
Successful
2026-10-21 12:15:39,295 - INFO - Generic metadata worked
2026-10-21 12:15:39,565 - DEBUG - Link local service introspect removed
2026-10-21 12:15:39,565 - INFO - Deleting VM ctest-TestBasicVMVN-78270578-64530813
2026-10-21 12:15:39,666 - INFO - Deleting VN ctest-vn2_metadata-41879943
2026-10-21 12:15:39,712 - DEBUG - VN 0f7fb98e-f2f2-4877-9569-ef2e98c57310 still in use: Unable to complete operation on network 0f7fb98e-f2f2-4877-9569-ef2e98c57310. There are one or more ports still in use on the network.
Neutron server returns request_ids: ['req-d3f9d9b2-f043-4694-9981-bb9157af5faa']
2026-10-21 12:15:39,712 - WARNING - Deleting VN ctest-vn2_metadata-41879943 failed..Will retry
2026-10-21 12:15:41,750 - DEBUG - VN 0f7fb98e-f2f2-4877-9569-ef2e98c57310 still in use: Unable to complete operation on network 0f7fb98e-f2f2-4877-9569-ef2e98c57310. There are one or more ports still in use on the network.
Neutron server returns request_ids: ['req-93878baf-a8da-4e00-8bc3-c06b4e0c9bfb']
2026-10-21 12:15:41,750 - WARNING - Deleting VN ctest-vn2_metadata-41879943 failed..Will retry
2026-10-21 12:15:43,875 - DEBUG - Response for deleting network ()
2026-10-21 12:15:44,147 - DEBUG - No XMPP flaps were noticed during the test
2026-10-21 12:15:44,147 - INFO - END TEST : test_generic_link_local_service : PASSED[0:01:25]
2026-10-21 12:15:44,147 - INFO - --------------------------------------------------------------------------------
2026-10-21 12:15:44,152 - INFO - ================================================================================
2026-10-21 12:15:44,152 - INFO - STARTING TEST : test_metadata_service
2026-10-21 12:15:44,152 - INFO - TEST DESCRIPTION :
Description: Test to validate metadata service on VM creation.
1.Verify from global-vrouter-config if metadata configures or not - fails otherwise
2.Create a shell script which writes 'hello world ' in a file in /tmp and save the script on the nova api node
3.Create a vm with userdata pointing to that script - script should get executed during vm boot up
4.Go to the vm and verify if the file with 'hello world ' written saved in /tmp of the vm - fails otherwise
Maintainer: sandipd@juniper.net
2026-10-21 12:15:44,460 - DEBUG - Nothing to compare xmpp stats {'10.0.0.185': {'10.20.0.17': '0'}} with
2026-10-21 12:15:44,460 - INFO - Initial checks done. Running the testcase now
2026-10-21 12:15:44,460 - INFO -
2026-10-21 12:15:44,461 - DEBUG - Requesting: http://10.0.0.185:8082/global-vrouter-configs
2026-10-21 12:15:44,469 - DEBUG - Requesting: http://10.0.0.185:8082/global-vrouter-config/69bd2cc5-9ffe-46a8-9d54-74837b37cfda
2026-10-21 12:15:44,679 - DEBUG - Response for create_network : {'network': {'id': 'b0574a62-c95a-4438-9e55-5eb097e3ed9f', 'name': 'ctest-vn-27343749', 'tenant_id': 'e7ffd15f3ac9488a93cf43bc1a974a74', 'project_id': 'e7ffd15f3ac9488a93cf43bc1a974a74', 'admin_state_up': True, 'shared': False, 'status': 'ACTIVE', 'router:external': False, 'mtu': 0, 'tags': [], 'subnets': [], 'fq_name': ['default-domain', 'ctest-TestBasicVMVN-78270578', 'ctest-vn-27343749'], 'port_security_enabled': True, 'description': ''}}
2026-10-21 12:15:44,897 - DEBUG - Response for create_subnet : {'subnet': {'id': '27f46eba-d8d8-431c-92e4-8a84bb7fe3b8', 'name': '', 'tenant_id': 'e7ffd15f3ac9488a93cf43bc1a974a74', 'network_id': 'b0574a62-c95a-4438-9e55-5eb097e3ed9f', 'ip_version': 4, 'cidr': '168.103.15.192/26', 'allocation_pools': [{'start': '168.103.15.194', 'end': '168.103.15.254'}], 'gateway_ip': '168.103.15.193', 'enable_dhcp': True, 'ipv6_ra_mode': None, 'ipv6_address_mode': None, 'dns_nameservers': [], 'host_routes': [], 'dns_server_address': '168.103.15.194', 'tags': [], 'project_id': 'e7ffd15f3ac9488a93cf43bc1a974a74'}}
2026-10-21 12:15:44,918 - INFO - Created VN ctest-vn-27343749
2026-10-21 12:15:44,981 - DEBUG - VN ctest-vn-27343749 UUID is b0574a62-c95a-4438-9e55-5eb097e3ed9f
2026-10-21 12:15:45,688 - INFO - VM ([]) created on node: (cn-jenkins-deploy-platform-ansible-os-6377-1), Zone: (nova:cn-jenkins-deploy-platform-ansible-os-6377-1)
2026-10-21 12:15:45,688 - INFO - Waiting for VM ctest-TestBasicVMVN-78270578-63165674 to be up..
2026-10-21 12:15:45,732 - DEBUG - VM is still in BUILD state, Expected: ACTIVE
2026-10-21 12:15:50,813 - DEBUG - VM is still in BUILD state, Expected: ACTIVE
2026-10-21 12:15:55,899 - DEBUG - VM is still in BUILD state, Expected: ACTIVE
2026-10-21 12:16:00,987 - DEBUG - VM is still in BUILD state, Expected: ACTIVE
2026-10-21 12:16:06,071 - DEBUG - VM is still in BUILD state, Expected: ACTIVE
2026-10-21 12:16:11,160 - DEBUG - VM is still in BUILD state, Expected: ACTIVE
2026-10-21 12:16:16,253 - DEBUG - VM is in ACTIVE state now
2026-10-21 12:16:16,253 - INFO - VM name : ctest-TestBasicVMVN-78270578-63165674
2026-10-21 12:16:16,339 - DEBUG - VM ctest-TestBasicVMVN-78270578-63165674 ID is 959aaa6c-41a8-4d57-ab73-4d8441863306
2026-10-21 12:16:16,340 - DEBUG - VM ctest-TestBasicVMVN-78270578-63165674 launched on Node cn-jenkins-deploy-platform-ansible-os-6377-1
2026-10-21 12:16:16,418 - DEBUG - Requesting: http://10.0.0.185:8082/virtual-machine/959aaa6c-41a8-4d57-ab73-4d8441863306
2026-10-21 12:16:16,427 - DEBUG - Requesting: http://10.0.0.185:8082/virtual-machine-interface/e294b5ab-d668-438c-9a0f-d6c4e9c21f68
2026-10-21 12:16:19,700 - DEBUG - (True, 'PING 169.254.0.3 (169.254.0.3) 56(84) bytes of data.\r\n\r\n--- 169.254.0.3 ping statistics ---\r\n2 packets transmitted, 0 received, 100% packet loss, time 1021ms')
2026-10-21 12:16:19,700 - DEBUG - Ping to Metadata IP 169.254.0.3 of VM ctest-TestBasicVMVN-78270578-63165674 failed!
2026-10-21 12:16:19,757 - DEBUG - Gateway for vn default-domain:ctest-TestBasicVMVN-78270578:ctest-vn-27343749 is 168.103.15.193 and allocation pool is NOT set
2026-10-21 12:16:21,824 - DEBUG - (True, 'PING 169.254.0.3 (169.254.0.3) 56(84) bytes of data.\r\n64 bytes from 169.254.0.3: icmp_seq=1 ttl=63 time=4.09 ms\r\n64 bytes from 169.254.0.3: icmp_seq=2 ttl=63 time=0.625 ms\r\n\r\n--- 169.254.0.3 ping statistics ---\r\n2 packets transmitted, 2 received, 0% packet loss, time 1001ms\r\nrtt min/avg/max/mdev = 0.625/2.355/4.086/1.730 ms')
2026-10-21 12:16:21,824 - INFO - Ping to Metadata IP 169.254.0.3 of VM ctest-TestBasicVMVN-78270578-63165674 passed
2026-10-21 12:16:21,981 - DEBUG - verify_vm_launched is skipped since self.vm_launch_flag is set
2026-10-21 12:16:21,981 - DEBUG - Waiting to SSH to VM ctest-TestBasicVMVN-78270578-63165674, IP 168.103.15.195, Port 22
2026-10-21 12:16:22,047 - DEBUG - Error on ssh to cirros@169.254.0.3:22, result: /bin/bash: connect: Connection refused
/bin/bash: line 1: /dev/tcp/169.254.0.3/22: Connection refused {'failed': True, 'command': '(echo > /dev/tcp/169.254.0.3/22)', 'real_command': '/bin/bash -l -c "(echo > /dev/tcp/169.254.0.3/22)"', 'return_code': 1, 'succeeded': False, 'stderr': ''}
2026-10-21 12:16:22,134 - DEBUG - VM ctest-TestBasicVMVN-78270578-63165674 is NOT ready for SSH connections, VM status: ACTIVE
2026-10-21 12:16:27,135 - DEBUG - verify_vm_launched is skipped since self.vm_launch_flag is set
2026-10-21 12:16:27,135 - DEBUG - Waiting to SSH to VM ctest-TestBasicVMVN-78270578-63165674, IP 168.103.15.195, Port 22
2026-10-21 12:16:27,203 - DEBUG - Error on ssh to cirros@169.254.0.3:22, result: /bin/bash: connect: Connection refused
/bin/bash: line 1: /dev/tcp/169.254.0.3/22: Connection refused {'failed': True, 'command': '(echo > /dev/tcp/169.254.0.3/22)', 'real_command': '/bin/bash -l -c "(echo > /dev/tcp/169.254.0.3/22)"', 'return_code': 1, 'succeeded': False, 'stderr': ''}
2026-10-21 12:16:27,300 - DEBUG - VM ctest-TestBasicVMVN-78270578-63165674 is NOT ready for SSH connections, VM status: ACTIVE
2026-10-21 12:16:32,300 - DEBUG - verify_vm_launched is skipped since self.vm_launch_flag is set
2026-10-21 12:16:32,301 - DEBUG - Waiting to SSH to VM ctest-TestBasicVMVN-78270578-63165674, IP 168.103.15.195, Port 22
2026-10-21 12:16:32,370 - DEBUG - Error on ssh to cirros@169.254.0.3:22, result: /bin/bash: connect: Connection refused
/bin/bash: line 1: /dev/tcp/169.254.0.3/22: Connection refused {'failed': True, 'command': '(echo > /dev/tcp/169.254.0.3/22)', 'real_command': '/bin/bash -l -c "(echo > /dev/tcp/169.254.0.3/22)"', 'return_code': 1, 'succeeded': False, 'stderr': ''}
2026-10-21 12:16:32,472 - DEBUG - VM ctest-TestBasicVMVN-78270578-63165674 is NOT ready for SSH connections, VM status: ACTIVE
2026-10-21 12:16:37,473 - DEBUG - verify_vm_launched is skipped since self.vm_launch_flag is set
2026-10-21 12:16:37,473 - DEBUG - Waiting to SSH to VM ctest-TestBasicVMVN-78270578-63165674, IP 168.103.15.195, Port 22
2026-10-21 12:16:37,540 - DEBUG - Error on ssh to cirros@169.254.0.3:22, result: /bin/bash: connect: Connection refused
/bin/bash: line 1: /dev/tcp/169.254.0.3/22: Connection refused {'failed': True, 'command': '(echo > /dev/tcp/169.254.0.3/22)', 'real_command': '/bin/bash -l -c "(echo > /dev/tcp/169.254.0.3/22)"', 'return_code': 1, 'succeeded': False, 'stderr': ''}
2026-10-21 12:16:37,628 - DEBUG - VM ctest-TestBasicVMVN-78270578-63165674 is NOT ready for SSH connections, VM status: ACTIVE
2026-10-21 12:16:42,629 - DEBUG - verify_vm_launched is skipped since self.vm_launch_flag is set
2026-10-21 12:16:42,629 - DEBUG - Waiting to SSH to VM ctest-TestBasicVMVN-78270578-63165674, IP 168.103.15.195, Port 22
2026-10-21 12:16:42,695 - DEBUG - Error on ssh to cirros@169.254.0.3:22, result: /bin/bash: connect: Connection refused
/bin/bash: line 1: /dev/tcp/169.254.0.3/22: Connection refused {'failed': True, 'command': '(echo > /dev/tcp/169.254.0.3/22)', 'real_command': '/bin/bash -l -c "(echo > /dev/tcp/169.254.0.3/22)"', 'return_code': 1, 'succeeded': False, 'stderr': ''}
2026-10-21 12:16:42,799 - DEBUG - VM ctest-TestBasicVMVN-78270578-63165674 is NOT ready for SSH connections, VM status: ACTIVE
2026-10-21 12:16:47,799 - DEBUG - verify_vm_launched is skipped since self.vm_launch_flag is set
2026-10-21 12:16:47,800 - DEBUG - Waiting to SSH to VM ctest-TestBasicVMVN-78270578-63165674, IP 168.103.15.195, Port 22
2026-10-21 12:16:47,857 - DEBUG - Error on ssh to cirros@169.254.0.3:22, result: /bin/bash: connect: Connection refused
/bin/bash: line 1: /dev/tcp/169.254.0.3/22: Connection refused {'failed': True, 'command': '(echo > /dev/tcp/169.254.0.3/22)', 'real_command': '/bin/bash -l -c "(echo > /dev/tcp/169.254.0.3/22)"', 'return_code': 1, 'succeeded': False, 'stderr': ''}
2026-10-21 12:16:47,946 - DEBUG - VM ctest-TestBasicVMVN-78270578-63165674 is NOT ready for SSH connections, VM status: ACTIVE
2026-10-21 12:16:52,946 - DEBUG - verify_vm_launched is skipped since self.vm_launch_flag is set
2026-10-21 12:16:52,946 - DEBUG - Waiting to SSH to VM ctest-TestBasicVMVN-78270578-63165674, IP 168.103.15.195, Port 22
2026-10-21 12:16:53,015 - DEBUG - Error on ssh to cirros@169.254.0.3:22, result: /bin/bash: connect: Connection refused
/bin/bash: line 1: /dev/tcp/169.254.0.3/22: Connection refused {'failed': True, 'command': '(echo > /dev/tcp/169.254.0.3/22)', 'real_command': '/bin/bash -l -c "(echo > /dev/tcp/169.254.0.3/22)"', 'return_code': 1, 'succeeded': False, 'stderr': ''}
2026-10-21 12:16:53,102 - DEBUG - VM ctest-TestBasicVMVN-78270578-63165674 is NOT ready for SSH connections, VM status: ACTIVE
2026-10-21 12:16:58,102 - DEBUG - verify_vm_launched is skipped since self.vm_launch_flag is set
2026-10-21 12:16:58,102 - DEBUG - Waiting to SSH to VM ctest-TestBasicVMVN-78270578-63165674, IP 168.103.15.195, Port 22
2026-10-21 12:16:58,171 - DEBUG - Error on ssh to cirros@169.254.0.3:22, result: /bin/bash: connect: Connection refused
/bin/bash: line 1: /dev/tcp/169.254.0.3/22: Connection refused {'failed': True, 'command': '(echo > /dev/tcp/169.254.0.3/22)', 'real_command': '/bin/bash -l -c "(echo > /dev/tcp/169.254.0.3/22)"', 'return_code': 1, 'succeeded': False, 'stderr': ''}
2026-10-21 12:16:58,254 - DEBUG - VM ctest-TestBasicVMVN-78270578-63165674 is NOT ready for SSH connections, VM status: ACTIVE
2026-10-21 12:17:03,255 - DEBUG - verify_vm_launched is skipped since self.vm_launch_flag is set
2026-10-21 12:17:03,255 - DEBUG - Waiting to SSH to VM ctest-TestBasicVMVN-78270578-63165674, IP 168.103.15.195, Port 22
2026-10-21 12:17:03,423 - DEBUG - VM ctest-TestBasicVMVN-78270578-63165674 is ready for SSH connections
2026-10-21 12:17:03,424 - DEBUG - Running remote_cmd, Cmd : cat /tmp/output.txt, host_string: cirros@169.254.0.3, password: cubswin:)gateway: ubuntu@10.0.0.185, gateway password: c0ntrail123
2026-10-21 12:17:03,424 - DEBUG - cat /tmp/output.txt
2026-10-21 12:17:05,485 - DEBUG - cat: can't open '/tmp/output.txt': No such file or directory
2026-10-21 12:17:05,485 - DEBUG - ret : {'cat /tmp/output.txt': "cat: can't open '/tmp/output.txt': No such file or directory"}
2026-10-21 12:17:05,486 - WARNING - metadata_script.txt did not get executed in the vm
2026-10-21 12:17:07,486 - DEBUG - Running remote_cmd, Cmd : cat /tmp/output.txt, host_string: cirros@169.254.0.3, password: cubswin:)gateway: ubuntu@10.0.0.185, gateway password: c0ntrail123
2026-10-21 12:17:07,487 - DEBUG - cat /tmp/output.txt
2026-10-21 12:17:07,614 - DEBUG - cat: can't open '/tmp/output.txt': No such file or directory
2026-10-21 12:17:07,614 - DEBUG - ret : {'cat /tmp/output.txt': "cat: can't open '/tmp/output.txt': No such file or directory"}
2026-10-21 12:17:07,614 - WARNING - metadata_script.txt did not get executed in the vm
2026-10-21 12:17:09,614 - DEBUG - Running remote_cmd, Cmd : cat /tmp/output.txt, host_string: cirros@169.254.0.3, password: cubswin:)gateway: ubuntu@10.0.0.185, gateway password: c0ntrail123
2026-10-21 12:17:09,615 - DEBUG - cat /tmp/output.txt
2026-10-21 12:17:09,732 - DEBUG - cat: can't open '/tmp/output.txt': No such file or directory
2026-10-21 12:17:09,732 - DEBUG - ret : {'cat /tmp/output.txt': "cat: can't open '/tmp/output.txt': No such file or directory"}
2026-10-21 12:17:09,732 - WARNING - metadata_script.txt did not get executed in the vm
2026-10-21 12:17:11,733 - DEBUG - Running remote_cmd, Cmd : cat /tmp/output.txt, host_string: cirros@169.254.0.3, password: cubswin:)gateway: ubuntu@10.0.0.185, gateway password: c0ntrail123
2026-10-21 12:17:11,734 - DEBUG - cat /tmp/output.txt
2026-10-21 12:17:11,848 - DEBUG - cat: can't open '/tmp/output.txt': No such file or directory
2026-10-21 12:17:11,848 - DEBUG - ret : {'cat /tmp/output.txt': "cat: can't open '/tmp/output.txt': No such file or directory"}
2026-10-21 12:17:11,848 - WARNING - metadata_script.txt did not get executed in the vm
2026-10-21 12:17:13,849 - DEBUG - Running remote_cmd, Cmd : cat /tmp/output.txt, host_string: cirros@169.254.0.3, password: cubswin:)gateway: ubuntu@10.0.0.185, gateway password: c0ntrail123
2026-10-21 12:17:13,849 - DEBUG - cat /tmp/output.txt
2026-10-21 12:17:13,964 - DEBUG - cat: can't open '/tmp/output.txt': No such file or directory
2026-10-21 12:17:13,964 - DEBUG - ret : {'cat /tmp/output.txt': "cat: can't open '/tmp/output.txt': No such file or directory"}
2026-10-21 12:17:13,964 - WARNING - metadata_script.txt did not get executed in the vm
2026-10-21 12:17:15,965 - DEBUG - Running remote_cmd, Cmd : cat /tmp/output.txt, host_string: cirros@169.254.0.3, password: cubswin:)gateway: ubuntu@10.0.0.185, gateway password: c0ntrail123
2026-10-21 12:17:15,966 - DEBUG - cat /tmp/output.txt
2026-10-21 12:17:16,080 - DEBUG - cat: can't open '/tmp/output.txt': No such file or directory
2026-10-21 12:17:16,080 - DEBUG - ret : {'cat /tmp/output.txt': "cat: can't open '/tmp/output.txt': No such file or directory"}
2026-10-21 12:17:16,081 - WARNING - metadata_script.txt did not get executed in the vm
2026-10-21 12:17:18,081 - DEBUG - Running remote_cmd, Cmd : cat /tmp/output.txt, host_string: cirros@169.254.0.3, password: cubswin:)gateway: ubuntu@10.0.0.185, gateway password: c0ntrail123
2026-10-21 12:17:18,082 - DEBUG - cat /tmp/output.txt
2026-10-21 12:17:18,207 - DEBUG - cat: can't open '/tmp/output.txt': No such file or directory
2026-10-21 12:17:18,207 - DEBUG - ret : {'cat /tmp/output.txt': "cat: can't open '/tmp/output.txt': No such file or directory"}
2026-10-21 12:17:18,207 - WARNING - metadata_script.txt did not get executed in the vm
2026-10-21 12:17:20,208 - DEBUG - Running remote_cmd, Cmd : cat /tmp/output.txt, host_string: cirros@169.254.0.3, password: cubswin:)gateway: ubuntu@10.0.0.185, gateway password: c0ntrail123
2026-10-21 12:17:20,208 - DEBUG - cat /tmp/output.txt
2026-10-21 12:17:20,325 - DEBUG - cat: can't open '/tmp/output.txt': No such file or directory
2026-10-21 12:17:20,325 - DEBUG - ret : {'cat /tmp/output.txt': "cat: can't open '/tmp/output.txt': No such file or directory"}
2026-10-21 12:17:20,325 - WARNING - metadata_script.txt did not get executed in the vm
2026-10-21 12:17:22,327 - DEBUG - Running remote_cmd, Cmd : cat /tmp/output.txt, host_string: cirros@169.254.0.3, password: cubswin:)gateway: ubuntu@10.0.0.185, gateway password: c0ntrail123
2026-10-21 12:17:22,327 - DEBUG - cat /tmp/output.txt
2026-10-21 12:17:22,455 - DEBUG - cat: can't open '/tmp/output.txt': No such file or directory
2026-10-21 12:17:22,456 - DEBUG - ret : {'cat /tmp/output.txt': "cat: can't open '/tmp/output.txt': No such file or directory"}
2026-10-21 12:17:22,456 - WARNING - metadata_script.txt did not get executed in the vm
2026-10-21 12:17:24,457 - DEBUG - Running remote_cmd, Cmd : cat /tmp/output.txt, host_string: cirros@169.254.0.3, password: cubswin:)gateway: ubuntu@10.0.0.185, gateway password: c0ntrail123
2026-10-21 12:17:24,457 - DEBUG - cat /tmp/output.txt
2026-10-21 12:17:24,572 - DEBUG - cat: can't open '/tmp/output.txt': No such file or directory
2026-10-21 12:17:24,572 - DEBUG - ret : {'cat /tmp/output.txt': "cat: can't open '/tmp/output.txt': No such file or directory"}
2026-10-21 12:17:24,572 - WARNING - metadata_script.txt did not get executed in the vm
2026-10-21 12:17:24,574 - INFO - Deleting VM ctest-TestBasicVMVN-78270578-63165674
2026-10-21 12:17:24,660 - INFO - Deleting VN ctest-vn-27343749
2026-10-21 12:17:24,697 - DEBUG - VN b0574a62-c95a-4438-9e55-5eb097e3ed9f still in use: Unable to complete operation on network b0574a62-c95a-4438-9e55-5eb097e3ed9f. There are one or more ports still in use on the network.
Neutron server returns request_ids: ['req-b8996bdd-0886-40cd-916b-f61d8c19f0ee']
2026-10-21 12:17:24,697 - WARNING - Deleting VN ctest-vn-27343749 failed..Will retry
2026-10-21 12:17:26,733 - DEBUG - VN b0574a62-c95a-4438-9e55-5eb097e3ed9f still in use: Unable to complete operation on network b0574a62-c95a-4438-9e55-5eb097e3ed9f. There are one or more ports still in use on the network.
Neutron server returns request_ids: ['req-3ebaf2e4-55c7-4203-b101-d15348cf8c1f']
2026-10-21 12:17:26,733 - WARNING - Deleting VN ctest-vn-27343749 failed..Will retry
2026-10-21 12:17:28,882 - DEBUG - Response for deleting network ()
2026-10-21 12:17:29,155 - ERROR - AssertionError
Python 3.9.25: /usr/bin/python3
Wed Oct 21 12:17:24 2026
A problem occurred in a Python script. Here is the sequence of
function calls leading up to the error, in the order they occurred.
/contrail-test/tcutils/wrappers.py in wrapper(self=, *args=(), **kwargs={})
78 log.info('Initial checks done. Running the testcase now')
79 log.info('')
80 result = function(self, *args, **kwargs)
81 if self.inputs.upgrade:
82 pid = os.getpid()
result = None
function =
self =
args = ()
kwargs = {}
/contrail-test/scripts/vm_regression/test_vm_basic.py in test_metadata_service(self=)
69 if i+1 < mtries:
70 time.sleep(2)
71 assert result
72
73 @test.attr(type=['suite1'])
result = False
AssertionError:
__cause__ = None
__class__ =
__context__ = None
__delattr__ =
__dict__ = {}
__dir__ =
__doc__ = 'Assertion failed.'
__eq__ =
__format__ =
__ge__ =
__getattribute__ =
__gt__ =
__hash__ =
__init__ =
__init_subclass__ =
__le__ =
__lt__ =
__ne__ =
__new__ =
__reduce__ =
__reduce_ex__ =
__repr__ =
__setattr__ =
__setstate__ =
__sizeof__ =
__str__ =
__subclasshook__ =
__suppress_context__ = False
__traceback__ =
args = ()
with_traceback =
The above is a description of an error in a Python program. Here is
the original traceback:
Traceback (most recent call last):
File "/contrail-test/tcutils/wrappers.py", line 80, in wrapper
result = function(self, *args, **kwargs)
File "/contrail-test/scripts/vm_regression/test_vm_basic.py", line 71, in test_metadata_service
assert result
AssertionError
2026-10-21 12:17:29,162 - DEBUG - No XMPP flaps were noticed during the test
2026-10-21 12:17:29,162 - INFO -
2026-10-21 12:17:29,162 - INFO - END TEST : test_metadata_service : FAILED[0:01:45]
2026-10-21 12:17:29,162 - INFO - --------------------------------------------------------------------------------
2026-10-21 12:17:29,166 - INFO - ================================================================================
2026-10-21 12:17:29,166 - INFO - STARTING TEST : test_ping_within_vn_two_vms_two_different_subnets
2026-10-21 12:17:29,166 - INFO - TEST DESCRIPTION :
Description: Validate Ping between 2 VMs in the same VN, 2 VMs in different VN
subnets.
Test steps:
1. Create 1 IPAM's.
2. Create 1 VN with 2 subnets and launch 2 VMs in them.
3. Ping between the VMs in the same VN should go thru fine.
4. Ping to the subnet broadcast and all-broadcast address.
Pass criteria: VM in the same subnet will respond to both the pings, while the VM in a different VN should respond only to the
all-broadcast address.
Maintainer : ganeshahv@juniper.net
2026-10-21 12:17:29,448 - DEBUG - Nothing to compare xmpp stats {'10.0.0.185': {'10.20.0.17': '0'}} with
2026-10-21 12:17:29,448 - INFO - Initial checks done. Running the testcase now
2026-10-21 12:17:29,448 - INFO -
2026-10-21 12:17:29,974 - DEBUG - Response for create_network : {'network': {'id': '00742774-f4e1-49ee-a02f-3174a9061865', 'name': 'ctest-vn-81032245', 'tenant_id': 'e7ffd15f3ac9488a93cf43bc1a974a74', 'project_id': 'e7ffd15f3ac9488a93cf43bc1a974a74', 'admin_state_up': True, 'shared': False, 'status': 'ACTIVE', 'router:external': False, 'mtu': 0, 'tags': [], 'subnets': [], 'fq_name': ['default-domain', 'ctest-TestBasicVMVN-78270578', 'ctest-vn-81032245'], 'port_security_enabled': True, 'description': ''}}
2026-10-21 12:17:30,196 - DEBUG - Response for create_subnet : {'subnet': {'id': '8e45ef00-7d31-412f-bb8e-f3902a69cf96', 'name': '', 'tenant_id': 'e7ffd15f3ac9488a93cf43bc1a974a74', 'network_id': '00742774-f4e1-49ee-a02f-3174a9061865', 'ip_version': 4, 'cidr': '31.1.1.0/29', 'allocation_pools': [{'start': '31.1.1.2', 'end': '31.1.1.6'}], 'gateway_ip': '31.1.1.1', 'enable_dhcp': True, 'ipv6_ra_mode': None, 'ipv6_address_mode': None, 'dns_nameservers': [], 'host_routes': [], 'dns_server_address': '31.1.1.2', 'tags': [], 'project_id': 'e7ffd15f3ac9488a93cf43bc1a974a74'}}
2026-10-21 12:17:30,400 - DEBUG - Response for create_subnet : {'subnet': {'id': '4aed66d4-9fe1-456c-b800-ad1a68aeaf0a', 'name': '', 'tenant_id': 'e7ffd15f3ac9488a93cf43bc1a974a74', 'network_id': '00742774-f4e1-49ee-a02f-3174a9061865', 'ip_version': 4, 'cidr': '31.1.2.0/29', 'allocation_pools': [{'start': '31.1.2.2', 'end': '31.1.2.6'}], 'gateway_ip': '31.1.2.1', 'enable_dhcp': True, 'ipv6_ra_mode': None, 'ipv6_address_mode': None, 'dns_nameservers': [], 'host_routes': [], 'dns_server_address': '31.1.2.2', 'tags': [], 'project_id': 'e7ffd15f3ac9488a93cf43bc1a974a74'}}
2026-10-21 12:17:30,429 - INFO - Created VN ctest-vn-81032245
2026-10-21 12:17:30,485 - DEBUG - VN ctest-vn-81032245 UUID is 00742774-f4e1-49ee-a02f-3174a9061865
2026-10-21 12:17:30,952 - DEBUG - Response for create_port : {'port': {'name': '7bf05aa8-3cf7-4824-9d73-41dc67abd212', 'id': '7bf05aa8-3cf7-4824-9d73-41dc67abd212', 'tenant_id': 'e7ffd15f3ac9488a93cf43bc1a974a74', 'network_id': '00742774-f4e1-49ee-a02f-3174a9061865', 'mac_address': '02:7b:f0:5a:a8:3c', 'binding:vnic_type': 'normal', 'binding:vif_details': {'port_filter': True}, 'binding:vif_type': 'unbound', 'binding:host_id': None, 'allowed_address_pairs': [], 'fixed_ips': [{'ip_address': '31.1.1.4', 'subnet_id': '8e45ef00-7d31-412f-bb8e-f3902a69cf96'}], 'security_groups': ['ecdb3ea0-d624-4e68-bc59-9a2a86ea1fe0'], 'admin_state_up': True, 'device_id': '', 'device_owner': '', 'status': 'DOWN', 'tags': [], 'port_security_enabled': True, 'description': '', 'project_id': 'e7ffd15f3ac9488a93cf43bc1a974a74'}}
2026-10-21 12:17:31,211 - DEBUG - Response for create_port : {'port': {'name': '335f4440-cf20-4bf2-8fd1-67a6d0522ab6', 'id': '335f4440-cf20-4bf2-8fd1-67a6d0522ab6', 'tenant_id': 'e7ffd15f3ac9488a93cf43bc1a974a74', 'network_id': '00742774-f4e1-49ee-a02f-3174a9061865', 'mac_address': '02:33:5f:44:40:cf', 'binding:vnic_type': 'normal', 'binding:vif_details': {'port_filter': True}, 'binding:vif_type': 'unbound', 'binding:host_id': None, 'allowed_address_pairs': [], 'fixed_ips': [{'ip_address': '31.1.2.4', 'subnet_id': '4aed66d4-9fe1-456c-b800-ad1a68aeaf0a'}], 'security_groups': ['ecdb3ea0-d624-4e68-bc59-9a2a86ea1fe0'], 'admin_state_up': True, 'device_id': '', 'device_owner': '', 'status': 'DOWN', 'tags': [], 'port_security_enabled': True, 'description': '', 'project_id': 'e7ffd15f3ac9488a93cf43bc1a974a74'}}
2026-10-21 12:17:31,678 - INFO - VM ([]) created on node: (cn-jenkins-deploy-platform-ansible-os-6377-1), Zone: (nova:cn-jenkins-deploy-platform-ansible-os-6377-1)
2026-10-21 12:17:32,240 - INFO - VM ([]) created on node: (cn-jenkins-deploy-platform-ansible-os-6377-1), Zone: (nova:cn-jenkins-deploy-platform-ansible-os-6377-1)
2026-10-21 12:17:32,834 - INFO - VM ([]) created on node: (cn-jenkins-deploy-platform-ansible-os-6377-1), Zone: (nova:cn-jenkins-deploy-platform-ansible-os-6377-1)
2026-10-21 12:17:32,834 - DEBUG - Requesting: http://10.0.0.185:8082/domains
2026-10-21 12:17:32,843 - DEBUG - Requesting: http://10.0.0.185:8082/domain/a83f978d-94a2-4908-8efe-835cbd47614f
2026-10-21 12:17:32,859 - DEBUG - Requesting: http://10.0.0.185:8082/project/e7ffd15f-3ac9-488a-93cf-43bc1a974a74
2026-10-21 12:17:32,938 - DEBUG - Requesting: http://10.0.0.185:8082/network-ipam/b23c861e-fc8c-4946-8c3f-0b7d65793d71
2026-10-21 12:17:32,950 - INFO - Verifications in API Server for IPAM: ctest-ipam-00822086 passed
2026-10-21 12:17:32,957 - DEBUG - Control-node 10.0.0.185 : IPAM object is : {'node_name': 'network-ipam:default-domain:ctest-TestBasicVMVN-78270578:ctest-ipam-00822086', 'interests': '-', 'advertised': '-', 'dbentryflags': None, 'obj_info': {'sequence_number': '0', 'origin': 'Cassandra', 'data': {'id-perms': {'permissions': {'owner': 'ctest-TestBasicVMVN-78270578', 'owner-access': '7', 'group': 'member', 'group-access': '7', 'other-access': '7'}, 'uuid': {'uuid-mslong': '12843287704998005062', 'uuid-lslong': '10105808722043944305'}, 'enable': 'true', 'created': '2026-10-21T12:17:29', 'last-modified': '2026-10-21T12:17:29', 'description': None, 'user-visible': 'true', 'creator': None}}}, 'neighbors': None, 'last_modified': '00:00:03.270897'}
2026-10-21 12:17:32,957 - INFO - Verifications in Control node for IPAM: ctest-ipam-00822086 passed
2026-10-21 12:17:32,957 - DEBUG - Requesting: http://10.0.0.185:8082/domains
2026-10-21 12:17:32,963 - DEBUG - Requesting: http://10.0.0.185:8082/domain/a83f978d-94a2-4908-8efe-835cbd47614f
2026-10-21 12:17:32,976 - DEBUG - Requesting: http://10.0.0.185:8082/project/e7ffd15f-3ac9-488a-93cf-43bc1a974a74
2026-10-21 12:17:33,051 - DEBUG - Requesting: http://10.0.0.185:8082/virtual-network/00742774-f4e1-49ee-a02f-3174a9061865
2026-10-21 12:17:33,063 - DEBUG - Requesting: http://10.0.0.185:8082/virtual-network/00742774-f4e1-49ee-a02f-3174a9061865
2026-10-21 12:17:33,078 - DEBUG - Requesting: http://10.0.0.185:8082/routing-instance/a866b523-0e2e-4f75-bd90-9df9848bc86c
2026-10-21 12:17:33,089 - DEBUG - Requesting: http://10.0.0.185:8082/routing-instance/a866b523-0e2e-4f75-bd90-9df9848bc86c
2026-10-21 12:17:33,099 - DEBUG - Requesting: http://10.0.0.185:8082/route-target/e81bf90e-13d9-4837-9cbc-843d9a8fc0c0
2026-10-21 12:17:33,109 - DEBUG - Route Targets: ['target:64512:8000005']
2026-10-21 12:17:33,109 - DEBUG - Requesting: http://10.0.0.185:8082/virtual-network/00742774-f4e1-49ee-a02f-3174a9061865
2026-10-21 12:17:33,121 - DEBUG - Requesting: http://10.0.0.185:8082/routing-instance/a866b523-0e2e-4f75-bd90-9df9848bc86c
2026-10-21 12:17:33,140 - INFO - Verified VN network id 12 for VN 00742774-f4e1-49ee-a02f-3174a9061865
2026-10-21 12:17:33,140 - INFO - Verifications in API Server for VN ctest-vn-81032245 passed
2026-10-21 12:17:33,140 - DEBUG - Requesting: http://10.0.0.185:8082/virtual-network/00742774-f4e1-49ee-a02f-3174a9061865
2026-10-21 12:17:33,155 - DEBUG - Requesting: http://10.0.0.185:8082/routing-instance/a866b523-0e2e-4f75-bd90-9df9848bc86c
2026-10-21 12:17:33,167 - DEBUG - Requesting: http://10.0.0.185:8082/routing-instance/a866b523-0e2e-4f75-bd90-9df9848bc86c
2026-10-21 12:17:33,179 - DEBUG - Requesting: http://10.0.0.185:8082/route-target/e81bf90e-13d9-4837-9cbc-843d9a8fc0c0
2026-10-21 12:17:33,196 - DEBUG - Control-node 10.0.0.185 : VN object is : {'node_name': 'virtual-network:default-domain:ctest-TestBasicVMVN-78270578:ctest-vn-81032245', 'interests': '-', 'advertised': '-', 'dbentryflags': None, 'obj_info': {'sequence_number': '0', 'origin': 'Cassandra', 'data': {'id-perms': {'permissions': {'owner': 'ctest-TestBasicVMVN-78270578', 'owner-access': '7', 'group': 'member', 'group-access': '7', 'other-access': '7'}, 'uuid': {'uuid-mslong': '32694480576530926', 'uuid-lslong': '11542498747095586917'}, 'enable': 'true', 'created': '2026-10-21T12:17:29', 'last-modified': '2026-10-21T12:17:30', 'description': None, 'user-visible': 'true', 'creator': None}}}, 'neighbors': None, 'last_modified': '00:00:02.841189'}
2026-10-21 12:17:33,204 - DEBUG - Route Targets: ['target:64512:8000005']
2026-10-21 12:17:33,204 - INFO - On all control nodes, Config, RI and RT verification for VN ctest-vn-81032245 passed
2026-10-21 12:17:33,204 - DEBUG - ====Verifying policy data for ctest-vn-81032245 in API_Server ======
2026-10-21 12:17:33,204 - DEBUG - Requesting: http://10.0.0.185:8082/domains
2026-10-21 12:17:33,211 - DEBUG - Requesting: http://10.0.0.185:8082/domain/a83f978d-94a2-4908-8efe-835cbd47614f
2026-10-21 12:17:33,227 - DEBUG - Requesting: http://10.0.0.185:8082/project/e7ffd15f-3ac9-488a-93cf-43bc1a974a74
2026-10-21 12:17:33,317 - DEBUG - Requesting: http://10.0.0.185:8082/virtual-network/00742774-f4e1-49ee-a02f-3174a9061865
2026-10-21 12:17:33,332 - DEBUG - =>VN ctest-vn-81032245 has no policy to be verified
2026-10-21 12:17:33,332 - DEBUG - Verifying the vn in opserver
2026-10-21 12:17:33,332 - DEBUG - Verifying the default-domain:ctest-TestBasicVMVN-78270578:ctest-vn-81032245 virtual network link through opserver 10.0.0.185
2026-10-21 12:17:33,332 - DEBUG - Requesting: http://10.0.0.185:8081/analytics/uves/virtual-networks
2026-10-21 12:17:33,718 - DEBUG - Requesting: http://10.0.0.185:8081/analytics/uves/virtual-networks
2026-10-21 12:17:33,809 - DEBUG - vn link and name as {'name': 'default-domain:ctest-TestBasicVMVN-78270578:ctest-vn-81032245', 'href': 'http://10.0.0.185:8081/analytics/uves/virtual-network/default-domain:ctest-TestBasicVMVN-78270578:ctest-vn-81032245?flat'}
2026-10-21 12:17:33,809 - INFO - Validated that VN default-domain:ctest-TestBasicVMVN-78270578:ctest-vn-81032245 is found in opserver
2026-10-21 12:17:33,820 - DEBUG - Do not have enough data to verify VN in agent
2026-10-21 12:17:33,826 - DEBUG - VRF ids for VN ctest-vn-81032245: {}
2026-10-21 12:17:33,826 - INFO - Waiting for VM ctest-TestBasicVMVN-78270578-65822546 to be up..
2026-10-21 12:17:33,888 - DEBUG - VM is still in BUILD state, Expected: ACTIVE
2026-10-21 12:17:38,973 - DEBUG - VM is still in BUILD state, Expected: ACTIVE
2026-10-21 12:17:44,086 - DEBUG - VM is still in BUILD state, Expected: ACTIVE
2026-10-21 12:17:49,181 - DEBUG - VM is still in BUILD state, Expected: ACTIVE
2026-10-21 12:17:54,295 - DEBUG - VM is still in BUILD state, Expected: ACTIVE
2026-10-21 12:17:59,375 - DEBUG - VM is still in BUILD state, Expected: ACTIVE
2026-10-21 12:18:04,469 - DEBUG - VM is still in BUILD state, Expected: ACTIVE
2026-10-21 12:18:09,561 - DEBUG - VM is still in BUILD state, Expected: ACTIVE
2026-10-21 12:18:14,651 - DEBUG - VM is still in BUILD state, Expected: ACTIVE
2026-10-21 12:18:19,752 - DEBUG - VM is still in BUILD state, Expected: ACTIVE
2026-10-21 12:18:24,876 - DEBUG - VM is still in BUILD state, Expected: ACTIVE
2026-10-21 12:18:29,987 - DEBUG - VM is in ACTIVE state now
2026-10-21 12:18:29,987 - INFO - VM name : ctest-TestBasicVMVN-78270578-65822546
2026-10-21 12:18:30,098 - DEBUG - VM ctest-TestBasicVMVN-78270578-65822546 ID is 84c1a6c4-969b-405d-b80a-664106af0a35
2026-10-21 12:18:30,098 - DEBUG - VM ctest-TestBasicVMVN-78270578-65822546 launched on Node cn-jenkins-deploy-platform-ansible-os-6377-1
2026-10-21 12:18:30,209 - DEBUG - Requesting: http://10.0.0.185:8082/virtual-machine/84c1a6c4-969b-405d-b80a-664106af0a35
2026-10-21 12:18:30,220 - DEBUG - Requesting: http://10.0.0.185:8082/virtual-machine-interface/7bf05aa8-3cf7-4824-9d73-41dc67abd212
2026-10-21 12:18:33,518 - DEBUG - (True, 'PING 169.254.0.3 (169.254.0.3) 56(84) bytes of data.\r\n\r\n--- 169.254.0.3 ping statistics ---\r\n2 packets transmitted, 0 received, 100% packet loss, time 1015ms')
2026-10-21 12:18:33,518 - DEBUG - Ping to Metadata IP 169.254.0.3 of VM ctest-TestBasicVMVN-78270578-65822546 failed!
2026-10-21 12:18:33,577 - DEBUG - Gateway for vn default-domain:ctest-TestBasicVMVN-78270578:ctest-vn-81032245 is 31.1.1.1 and allocation pool is NOT set
2026-10-21 12:18:33,577 - DEBUG - Gateway for vn default-domain:ctest-TestBasicVMVN-78270578:ctest-vn-81032245 is 31.1.2.1 and allocation pool is NOT set
2026-10-21 12:18:35,643 - DEBUG - (True, 'PING 169.254.0.3 (169.254.0.3) 56(84) bytes of data.\r\n64 bytes from 169.254.0.3: icmp_seq=1 ttl=63 time=14.8 ms\r\n64 bytes from 169.254.0.3: icmp_seq=2 ttl=63 time=0.667 ms\r\n\r\n--- 169.254.0.3 ping statistics ---\r\n2 packets transmitted, 2 received, 0% packet loss, time 1002ms\r\nrtt min/avg/max/mdev = 0.667/7.718/14.770/7.051 ms')
2026-10-21 12:18:35,644 - INFO - Ping to Metadata IP 169.254.0.3 of VM ctest-TestBasicVMVN-78270578-65822546 passed
2026-10-21 12:18:35,801 - DEBUG - verify_vm_launched is skipped since self.vm_launch_flag is set
2026-10-21 12:18:35,801 - DEBUG - Waiting to SSH to VM ctest-TestBasicVMVN-78270578-65822546, IP 31.1.1.4, Port 22
2026-10-21 12:18:35,870 - DEBUG - Error on ssh to cirros@169.254.0.3:22, result: /bin/bash: connect: Connection refused
/bin/bash: line 1: /dev/tcp/169.254.0.3/22: Connection refused {'failed': True, 'command': '(echo > /dev/tcp/169.254.0.3/22)', 'real_command': '/bin/bash -l -c "(echo > /dev/tcp/169.254.0.3/22)"', 'return_code': 1, 'succeeded': False, 'stderr': ''}
2026-10-21 12:18:35,983 - DEBUG - VM ctest-TestBasicVMVN-78270578-65822546 is NOT ready for SSH connections, VM status: ACTIVE
2026-10-21 12:18:40,984 - DEBUG - verify_vm_launched is skipped since self.vm_launch_flag is set
2026-10-21 12:18:40,984 - DEBUG - Waiting to SSH to VM ctest-TestBasicVMVN-78270578-65822546, IP 31.1.1.4, Port 22
2026-10-21 12:18:41,051 - DEBUG - Error on ssh to cirros@169.254.0.3:22, result: /bin/bash: connect: Connection refused
/bin/bash: line 1: /dev/tcp/169.254.0.3/22: Connection refused {'failed': True, 'command': '(echo > /dev/tcp/169.254.0.3/22)', 'real_command': '/bin/bash -l -c "(echo > /dev/tcp/169.254.0.3/22)"', 'return_code': 1, 'succeeded': False, 'stderr': ''}
2026-10-21 12:18:41,141 - DEBUG - VM ctest-TestBasicVMVN-78270578-65822546 is NOT ready for SSH connections, VM status: ACTIVE
2026-10-21 12:18:46,142 - DEBUG - verify_vm_launched is skipped since self.vm_launch_flag is set
2026-10-21 12:18:46,142 - DEBUG - Waiting to SSH to VM ctest-TestBasicVMVN-78270578-65822546, IP 31.1.1.4, Port 22
2026-10-21 12:18:46,207 - DEBUG - Error on ssh to cirros@169.254.0.3:22, result: /bin/bash: connect: Connection refused
/bin/bash: line 1: /dev/tcp/169.254.0.3/22: Connection refused {'failed': True, 'command': '(echo > /dev/tcp/169.254.0.3/22)', 'real_command': '/bin/bash -l -c "(echo > /dev/tcp/169.254.0.3/22)"', 'return_code': 1, 'succeeded': False, 'stderr': ''}
2026-10-21 12:18:46,299 - DEBUG - VM ctest-TestBasicVMVN-78270578-65822546 is NOT ready for SSH connections, VM status: ACTIVE
2026-10-21 12:18:51,300 - DEBUG - verify_vm_launched is skipped since self.vm_launch_flag is set
2026-10-21 12:18:51,300 - DEBUG - Waiting to SSH to VM ctest-TestBasicVMVN-78270578-65822546, IP 31.1.1.4, Port 22
2026-10-21 12:18:51,357 - DEBUG - Error on ssh to cirros@169.254.0.3:22, result: /bin/bash: connect: Connection refused
/bin/bash: line 1: /dev/tcp/169.254.0.3/22: Connection refused {'failed': True, 'command': '(echo > /dev/tcp/169.254.0.3/22)', 'real_command': '/bin/bash -l -c "(echo > /dev/tcp/169.254.0.3/22)"', 'return_code': 1, 'succeeded': False, 'stderr': ''}
2026-10-21 12:18:51,447 - DEBUG - VM ctest-TestBasicVMVN-78270578-65822546 is NOT ready for SSH connections, VM status: ACTIVE
2026-10-21 12:18:56,447 - DEBUG - verify_vm_launched is skipped since self.vm_launch_flag is set
2026-10-21 12:18:56,448 - DEBUG - Waiting to SSH to VM ctest-TestBasicVMVN-78270578-65822546, IP 31.1.1.4, Port 22
2026-10-21 12:18:56,516 - DEBUG - Error on ssh to cirros@169.254.0.3:22, result: /bin/bash: connect: Connection refused
/bin/bash: line 1: /dev/tcp/169.254.0.3/22: Connection refused {'failed': True, 'command': '(echo > /dev/tcp/169.254.0.3/22)', 'real_command': '/bin/bash -l -c "(echo > /dev/tcp/169.254.0.3/22)"', 'return_code': 1, 'succeeded': False, 'stderr': ''}
2026-10-21 12:18:56,611 - DEBUG - VM ctest-TestBasicVMVN-78270578-65822546 is NOT ready for SSH connections, VM status: ACTIVE
2026-10-21 12:19:01,612 - DEBUG - verify_vm_launched is skipped since self.vm_launch_flag is set
2026-10-21 12:19:01,612 - DEBUG - Waiting to SSH to VM ctest-TestBasicVMVN-78270578-65822546, IP 31.1.1.4, Port 22
2026-10-21 12:19:01,680 - DEBUG - Error on ssh to cirros@169.254.0.3:22, result: /bin/bash: connect: Connection refused
/bin/bash: line 1: /dev/tcp/169.254.0.3/22: Connection refused {'failed': True, 'command': '(echo > /dev/tcp/169.254.0.3/22)', 'real_command': '/bin/bash -l -c "(echo > /dev/tcp/169.254.0.3/22)"', 'return_code': 1, 'succeeded': False, 'stderr': ''}
2026-10-21 12:19:01,768 - DEBUG - VM ctest-TestBasicVMVN-78270578-65822546 is NOT ready for SSH connections, VM status: ACTIVE
2026-10-21 12:19:06,769 - DEBUG - verify_vm_launched is skipped since self.vm_launch_flag is set
2026-10-21 12:19:06,769 - DEBUG - Waiting to SSH to VM ctest-TestBasicVMVN-78270578-65822546, IP 31.1.1.4, Port 22
2026-10-21 12:19:06,843 - DEBUG - Error on ssh to cirros@169.254.0.3:22, result: /bin/bash: connect: Connection refused
/bin/bash: line 1: /dev/tcp/169.254.0.3/22: Connection refused {'failed': True, 'command': '(echo > /dev/tcp/169.254.0.3/22)', 'real_command': '/bin/bash -l -c "(echo > /dev/tcp/169.254.0.3/22)"', 'return_code': 1, 'succeeded': False, 'stderr': ''}
2026-10-21 12:19:06,933 - DEBUG - VM ctest-TestBasicVMVN-78270578-65822546 is NOT ready for SSH connections, VM status: ACTIVE
2026-10-21 12:19:11,934 - DEBUG - verify_vm_launched is skipped since self.vm_launch_flag is set
2026-10-21 12:19:11,934 - DEBUG - Waiting to SSH to VM ctest-TestBasicVMVN-78270578-65822546, IP 31.1.1.4, Port 22
2026-10-21 12:19:12,007 - DEBUG - Error on ssh to cirros@169.254.0.3:22, result: /bin/bash: connect: Connection refused
/bin/bash: line 1: /dev/tcp/169.254.0.3/22: Connection refused {'failed': True, 'command': '(echo > /dev/tcp/169.254.0.3/22)', 'real_command': '/bin/bash -l -c "(echo > /dev/tcp/169.254.0.3/22)"', 'return_code': 1, 'succeeded': False, 'stderr': ''}
2026-10-21 12:19:12,101 - DEBUG - VM ctest-TestBasicVMVN-78270578-65822546 is NOT ready for SSH connections, VM status: ACTIVE
2026-10-21 12:19:17,102 - DEBUG - verify_vm_launched is skipped since self.vm_launch_flag is set
2026-10-21 12:19:17,102 - DEBUG - Waiting to SSH to VM ctest-TestBasicVMVN-78270578-65822546, IP 31.1.1.4, Port 22
2026-10-21 12:19:17,267 - DEBUG - VM ctest-TestBasicVMVN-78270578-65822546 is ready for SSH connections
2026-10-21 12:19:17,267 - INFO - Waiting for VM ctest-TestBasicVMVN-78270578-78878636 to be up..
2026-10-21 12:19:17,352 - DEBUG - VM is in ACTIVE state now
2026-10-21 12:19:17,352 - INFO - VM name : ctest-TestBasicVMVN-78270578-78878636
2026-10-21 12:19:17,432 - DEBUG - VM ctest-TestBasicVMVN-78270578-78878636 ID is 8d39d33a-7164-4a40-b5bf-688badd960f7
2026-10-21 12:19:17,432 - DEBUG - VM ctest-TestBasicVMVN-78270578-78878636 launched on Node cn-jenkins-deploy-platform-ansible-os-6377-1
2026-10-21 12:19:17,525 - DEBUG - Requesting: http://10.0.0.185:8082/virtual-machine/8d39d33a-7164-4a40-b5bf-688badd960f7
2026-10-21 12:19:17,535 - DEBUG - Requesting: http://10.0.0.185:8082/virtual-machine-interface/335f4440-cf20-4bf2-8fd1-67a6d0522ab6
2026-10-21 12:19:18,783 - DEBUG - (True, 'PING 169.254.0.4 (169.254.0.4) 56(84) bytes of data.\r\n64 bytes from 169.254.0.4: icmp_seq=1 ttl=63 time=2.46 ms\r\n64 bytes from 169.254.0.4: icmp_seq=2 ttl=63 time=0.544 ms\r\n\r\n--- 169.254.0.4 ping statistics ---\r\n2 packets transmitted, 2 received, 0% packet loss, time 1001ms\r\nrtt min/avg/max/mdev = 0.544/1.500/2.456/0.956 ms')
2026-10-21 12:19:18,784 - INFO - Ping to Metadata IP 169.254.0.4 of VM ctest-TestBasicVMVN-78270578-78878636 passed
2026-10-21 12:19:18,941 - DEBUG - verify_vm_launched is skipped since self.vm_launch_flag is set
2026-10-21 12:19:18,941 - DEBUG - Waiting to SSH to VM ctest-TestBasicVMVN-78270578-78878636, IP 31.1.2.4, Port 22
2026-10-21 12:19:19,008 - DEBUG - Error on ssh to cirros@169.254.0.4:22, result: /bin/bash: connect: Connection refused
/bin/bash: line 1: /dev/tcp/169.254.0.4/22: Connection refused {'failed': True, 'command': '(echo > /dev/tcp/169.254.0.4/22)', 'real_command': '/bin/bash -l -c "(echo > /dev/tcp/169.254.0.4/22)"', 'return_code': 1, 'succeeded': False, 'stderr': ''}
2026-10-21 12:19:19,139 - DEBUG - VM ctest-TestBasicVMVN-78270578-78878636 is NOT ready for SSH connections, VM status: ACTIVE
2026-10-21 12:19:24,140 - DEBUG - verify_vm_launched is skipped since self.vm_launch_flag is set
2026-10-21 12:19:24,140 - DEBUG - Waiting to SSH to VM ctest-TestBasicVMVN-78270578-78878636, IP 31.1.2.4, Port 22
2026-10-21 12:19:24,308 - DEBUG - VM ctest-TestBasicVMVN-78270578-78878636 is ready for SSH connections
2026-10-21 12:19:24,308 - INFO - Waiting for VM ctest-TestBasicVMVN-78270578-47167208 to be up..
2026-10-21 12:19:24,394 - DEBUG - VM is in ACTIVE state now
2026-10-21 12:19:24,394 - INFO - VM name : ctest-TestBasicVMVN-78270578-47167208
2026-10-21 12:19:24,473 - DEBUG - VM ctest-TestBasicVMVN-78270578-47167208 ID is 3c865851-f28c-4192-a913-e7809737aeda
2026-10-21 12:19:24,474 - DEBUG - VM ctest-TestBasicVMVN-78270578-47167208 launched on Node cn-jenkins-deploy-platform-ansible-os-6377-1
2026-10-21 12:19:24,554 - DEBUG - Requesting: http://10.0.0.185:8082/virtual-machine/3c865851-f28c-4192-a913-e7809737aeda
2026-10-21 12:19:24,564 - DEBUG - Requesting: http://10.0.0.185:8082/virtual-machine-interface/161be34d-ad2c-4f5b-8bd5-5c98d4c89dcd
2026-10-21 12:19:25,828 - DEBUG - (True, 'PING 169.254.0.5 (169.254.0.5) 56(84) bytes of data.\r\n64 bytes from 169.254.0.5: icmp_seq=1 ttl=63 time=3.41 ms\r\n64 bytes from 169.254.0.5: icmp_seq=2 ttl=63 time=0.511 ms\r\n\r\n--- 169.254.0.5 ping statistics ---\r\n2 packets transmitted, 2 received, 0% packet loss, time 1001ms\r\nrtt min/avg/max/mdev = 0.511/1.962/3.413/1.451 ms')
2026-10-21 12:19:25,828 - INFO - Ping to Metadata IP 169.254.0.5 of VM ctest-TestBasicVMVN-78270578-47167208 passed
2026-10-21 12:19:25,981 - DEBUG - verify_vm_launched is skipped since self.vm_launch_flag is set
2026-10-21 12:19:25,981 - DEBUG - Waiting to SSH to VM ctest-TestBasicVMVN-78270578-47167208, IP 31.1.1.3, Port 22
2026-10-21 12:19:26,151 - DEBUG - VM ctest-TestBasicVMVN-78270578-47167208 is ready for SSH connections
2026-10-21 12:19:26,152 - DEBUG - verify_vm_launched is skipped since self.vm_launch_flag is set
2026-10-21 12:19:26,152 - DEBUG - Running remote_cmd, Cmd : ping -s 56 -c 3 -W 1 31.1.2.4, host_string: cirros@169.254.0.3, password: cubswin:)gateway: ubuntu@10.0.0.185, gateway password: c0ntrail123
2026-10-21 12:19:26,152 - DEBUG - ping -s 56 -c 3 -W 1 31.1.2.4
2026-10-21 12:19:30,321 - DEBUG - PING 31.1.2.4 (31.1.2.4): 56 data bytes
64 bytes from 31.1.2.4: seq=0 ttl=63 time=2.389 ms
64 bytes from 31.1.2.4: seq=1 ttl=63 time=1.259 ms
64 bytes from 31.1.2.4: seq=2 ttl=63 time=0.985 ms
--- 31.1.2.4 ping statistics ---
3 packets transmitted, 3 packets received, 0% packet loss
round-trip min/avg/max = 0.985/1.544/2.389 ms
2026-10-21 12:19:30,321 - INFO - Ping to IP 31.1.2.4 from VM ctest-TestBasicVMVN-78270578-65822546 passed
2026-10-21 12:19:30,321 - DEBUG - verify_vm_launched is skipped since self.vm_launch_flag is set
2026-10-21 12:19:30,321 - DEBUG - Running remote_cmd, Cmd : ping -s 56 -c 3 -W 1 31.1.1.4, host_string: cirros@169.254.0.4, password: cubswin:)gateway: ubuntu@10.0.0.185, gateway password: c0ntrail123
2026-10-21 12:19:30,321 - DEBUG - ping -s 56 -c 3 -W 1 31.1.1.4
2026-10-21 12:19:33,984 - DEBUG - PING 31.1.1.4 (31.1.1.4): 56 data bytes
64 bytes from 31.1.1.4: seq=0 ttl=63 time=1.294 ms
64 bytes from 31.1.1.4: seq=1 ttl=63 time=1.144 ms
64 bytes from 31.1.1.4: seq=2 ttl=63 time=1.167 ms
--- 31.1.1.4 ping statistics ---
3 packets transmitted, 3 packets received, 0% packet loss
round-trip min/avg/max = 1.144/1.201/1.294 ms
2026-10-21 12:19:33,985 - INFO - Ping to IP 31.1.1.4 from VM ctest-TestBasicVMVN-78270578-78878636 passed
2026-10-21 12:19:33,985 - DEBUG - verify_vm_launched is skipped since self.vm_launch_flag is set
2026-10-21 12:19:33,985 - DEBUG - verify_vm_launched is skipped since self.vm_launch_flag is set
2026-10-21 12:19:33,985 - DEBUG - verify_vm_launched is skipped since self.vm_launch_flag is set
2026-10-21 12:19:33,985 - DEBUG - Running remote_cmd, Cmd : echo 0 > /proc/sys/net/ipv4/icmp_echo_ignore_broadcasts, host_string: cirros@169.254.0.3, password: cubswin:)gateway: ubuntu@10.0.0.185, gateway password: c0ntrail123
2026-10-21 12:19:33,985 - DEBUG - echo 0 > /proc/sys/net/ipv4/icmp_echo_ignore_broadcasts
2026-10-21 12:19:34,136 - DEBUG - None
2026-10-21 12:19:34,136 - DEBUG - Running remote_cmd, Cmd : echo 0 > /proc/sys/net/ipv4/icmp_echo_ignore_broadcasts, host_string: cirros@169.254.0.4, password: cubswin:)gateway: ubuntu@10.0.0.185, gateway password: c0ntrail123
2026-10-21 12:19:34,137 - DEBUG - echo 0 > /proc/sys/net/ipv4/icmp_echo_ignore_broadcasts
2026-10-21 12:19:34,263 - DEBUG - None
2026-10-21 12:19:34,263 - DEBUG - Running remote_cmd, Cmd : echo 0 > /proc/sys/net/ipv4/icmp_echo_ignore_broadcasts, host_string: cirros@169.254.0.5, password: cubswin:)gateway: ubuntu@10.0.0.185, gateway password: c0ntrail123
2026-10-21 12:19:34,263 - DEBUG - echo 0 > /proc/sys/net/ipv4/icmp_echo_ignore_broadcasts
2026-10-21 12:19:35,934 - DEBUG - None
2026-10-21 12:19:35,934 - DEBUG - Running remote_cmd, Cmd : ping -s 56 -c 3 -W 1 31.1.1.7, host_string: cirros@169.254.0.3, password: cubswin:)gateway: ubuntu@10.0.0.185, gateway password: c0ntrail123
2026-10-21 12:19:35,934 - DEBUG - ping -s 56 -c 3 -W 1 31.1.1.7
2026-10-21 12:19:38,077 - DEBUG - PING 31.1.1.7 (31.1.1.7): 56 data bytes
64 bytes from 31.1.1.4: seq=0 ttl=64 time=2.564 ms
64 bytes from 31.1.1.3: seq=0 ttl=64 time=6.053 ms (DUP!)
64 bytes from 31.1.1.4: seq=1 ttl=64 time=0.453 ms
64 bytes from 31.1.1.3: seq=1 ttl=64 time=1.922 ms (DUP!)
64 bytes from 31.1.1.4: seq=2 ttl=64 time=0.404 ms
--- 31.1.1.7 ping statistics ---
3 packets transmitted, 3 packets received, 2 duplicates, 0% packet loss
round-trip min/avg/max = 0.404/2.279/6.053 ms
2026-10-21 12:19:38,077 - DEBUG - Running remote_cmd, Cmd : ping -s 56 -c 3 -W 1 224.0.0.1, host_string: cirros@169.254.0.3, password: cubswin:)gateway: ubuntu@10.0.0.185, gateway password: c0ntrail123
2026-10-21 12:19:38,078 - DEBUG - ping -s 56 -c 3 -W 1 224.0.0.1
2026-10-21 12:19:40,249 - DEBUG - PING 224.0.0.1 (224.0.0.1): 56 data bytes
64 bytes from 31.1.1.4: seq=0 ttl=64 time=1.018 ms
64 bytes from 31.1.1.3: seq=0 ttl=64 time=3.069 ms (DUP!)
64 bytes from 31.1.2.4: seq=0 ttl=63 time=4.481 ms (DUP!)
64 bytes from 31.1.1.4: seq=1 ttl=64 time=0.499 ms
64 bytes from 31.1.2.4: seq=1 ttl=63 time=2.212 ms (DUP!)
64 bytes from 31.1.1.3: seq=1 ttl=64 time=3.265 ms (DUP!)
64 bytes from 31.1.1.4: seq=2 ttl=64 time=0.456 ms
--- 224.0.0.1 ping statistics ---
3 packets transmitted, 3 packets received, 4 duplicates, 0% packet loss
round-trip min/avg/max = 0.456/2.142/4.481 ms
2026-10-21 12:19:40,249 - DEBUG - Running remote_cmd, Cmd : ping -s 56 -c 3 -W 1 255.255.255.255, host_string: cirros@169.254.0.3, password: cubswin:)gateway: ubuntu@10.0.0.185, gateway password: c0ntrail123
2026-10-21 12:19:40,250 - DEBUG - ping -s 56 -c 3 -W 1 255.255.255.255
2026-10-21 12:19:42,431 - DEBUG - PING 255.255.255.255 (255.255.255.255): 56 data bytes
64 bytes from 31.1.1.4: seq=0 ttl=64 time=0.734 ms
64 bytes from 31.1.1.3: seq=0 ttl=64 time=8.716 ms (DUP!)
64 bytes from 31.1.2.4: seq=0 ttl=63 time=9.959 ms (DUP!)
64 bytes from 31.1.1.4: seq=1 ttl=64 time=0.484 ms
64 bytes from 31.1.2.4: seq=1 ttl=63 time=2.733 ms (DUP!)
64 bytes from 31.1.1.3: seq=1 ttl=64 time=3.860 ms (DUP!)
64 bytes from 31.1.1.4: seq=2 ttl=64 time=0.578 ms
--- 255.255.255.255 ping statistics ---
3 packets transmitted, 3 packets received, 4 duplicates, 0% packet loss
round-trip min/avg/max = 0.484/3.866/9.959 ms
2026-10-21 12:19:42,432 - INFO - Deleting VM ctest-TestBasicVMVN-78270578-47167208
2026-10-21 12:19:42,527 - INFO - Detaching port 335f4440-cf20-4bf2-8fd1-67a6d0522ab6 from VM ctest-TestBasicVMVN-78270578-78878636
2026-10-21 12:19:42,574 - INFO - Deleting VM ctest-TestBasicVMVN-78270578-78878636
2026-10-21 12:19:42,689 - INFO - Detaching port 7bf05aa8-3cf7-4824-9d73-41dc67abd212 from VM ctest-TestBasicVMVN-78270578-65822546
2026-10-21 12:19:42,738 - INFO - Deleting VM ctest-TestBasicVMVN-78270578-65822546
2026-10-21 12:19:42,818 - INFO - Deleting VN ctest-vn-81032245
2026-10-21 12:19:43,060 - DEBUG - Response for delete_port : ()
2026-10-21 12:19:43,256 - DEBUG - Response for delete_port : ()
2026-10-21 12:19:43,301 - DEBUG - VN 00742774-f4e1-49ee-a02f-3174a9061865 still in use: Unable to complete operation on network 00742774-f4e1-49ee-a02f-3174a9061865. There are one or more ports still in use on the network.
Neutron server returns request_ids: ['req-3f6e6d57-445b-46af-a1de-7406ac1eae9a']
2026-10-21 12:19:43,302 - WARNING - Deleting VN ctest-vn-81032245 failed..Will retry
2026-10-21 12:19:45,348 - DEBUG - VN 00742774-f4e1-49ee-a02f-3174a9061865 still in use: Unable to complete operation on network 00742774-f4e1-49ee-a02f-3174a9061865. There are one or more ports still in use on the network.
Neutron server returns request_ids: ['req-e03c8fdf-c299-417b-9857-307ac083e45e']
2026-10-21 12:19:45,348 - WARNING - Deleting VN ctest-vn-81032245 failed..Will retry
2026-10-21 12:19:47,388 - DEBUG - VN 00742774-f4e1-49ee-a02f-3174a9061865 still in use: Unable to complete operation on network 00742774-f4e1-49ee-a02f-3174a9061865. There are one or more ports still in use on the network.
Neutron server returns request_ids: ['req-8e2a3eac-186d-474a-82f4-264650760b7e']
2026-10-21 12:19:47,388 - WARNING - Deleting VN ctest-vn-81032245 failed..Will retry
2026-10-21 12:19:49,426 - DEBUG - VN 00742774-f4e1-49ee-a02f-3174a9061865 still in use: Unable to complete operation on network 00742774-f4e1-49ee-a02f-3174a9061865. There are one or more ports still in use on the network.
Neutron server returns request_ids: ['req-ecc61f24-33f3-4f39-b3b9-e25e1a7ce9b5']
2026-10-21 12:19:49,426 - WARNING - Deleting VN ctest-vn-81032245 failed..Will retry
2026-10-21 12:19:51,564 - DEBUG - Response for deleting network ()
2026-10-21 12:19:51,564 - DEBUG - Requesting: http://10.0.0.185:8082/routing-instance/a866b523-0e2e-4f75-bd90-9df9848bc86c
2026-10-21 12:19:51,570 - DEBUG - Response Code: 404
2026-10-21 12:19:51,570 - DEBUG - Requesting: http://10.0.0.185:8082/domains
2026-10-21 12:19:51,577 - DEBUG - Requesting: http://10.0.0.185:8082/domain/a83f978d-94a2-4908-8efe-835cbd47614f
2026-10-21 12:19:51,631 - DEBUG - Requesting: http://10.0.0.185:8082/project/e7ffd15f-3ac9-488a-93cf-43bc1a974a74
2026-10-21 12:19:51,711 - INFO - Validated that VN ctest-vn-81032245 is not found in API Server
2026-10-21 12:19:51,722 - DEBUG - VN ctest-vn-81032245 is not present in Agent 10.0.0.185
2026-10-21 12:19:51,722 - INFO - Validated that VN ctest-vn-81032245 is not in any agent
2026-10-21 12:19:51,740 - INFO - Validated that Routing instances and Config db in Control-nodes does not have VN ctest-vn-81032245 info
2026-10-21 12:19:51,817 - INFO - IPAM: ctest-ipam-00822086 is not found in API Server
2026-10-21 12:19:51,828 - INFO - IPAM:ctest-ipam-00822086 is not found in control node
2026-10-21 12:19:52,099 - DEBUG - No XMPP flaps were noticed during the test
2026-10-21 12:19:52,099 - INFO - END TEST : test_ping_within_vn_two_vms_two_different_subnets : PASSED[0:02:23]
2026-10-21 12:19:52,099 - INFO - --------------------------------------------------------------------------------
2026-10-21 12:19:52,938 - INFO - Deleted project: ctest-TestBasicVMVN-78270578, ID : e7ffd15f-3ac9-488a-93cf-43bc1a974a74